{"text_format":"1","workbook":"xlsx","n_sheets":4,"sheets":["SIMULADOR VF","DATOS","AMORTIZACIÓN MIFEL","AMORTIZACIÓN INFONAVIT"],"not_rendered":{"charts":0,"images":3,"macros":1,"external_links":0,"defined_names":23,"comments":0,"pivot_tables":0},"unopened":[],"bounds":{"document_bytes":16777216,"sheet_cells":100000,"rows_first":2000,"rows_last":500,"rows_between":2000,"halvings":0,"cell_chars":16384,"cell_head_chars":4096},"cells_cut":0,"cells_raw":0,"read":"whole","date_system":"1900"}

{"sheet":"SIMULADOR VF","index":0,"n_rows":38,"n_cols":8,"rows_kept":38,"cut":false,"hidden":false,"merged":[[32,6,32,7],[26,6,26,7],[33,6,33,7],[34,6,34,7],[29,6,29,7],[28,6,28,7],[27,6,27,7],[30,6,30,7],[4,3,4,5],[25,5,25,7],[23,6,23,7],[19,6,19,7],[32,2,32,3],[7,2,7,4],[9,2,9,7],[10,3,10,7],[16,2,16,3],[16,5,16,7],[21,6,21,7],[18,6,18,7],[22,6,22,7],[11,3,11,7],[12,3,12,7],[13,6,13,7]]}
[]
[]
[]
[]
[null,null,null,"SIMULADOR RESIDENCIAL BANCA MIFEL  "]
[]
[]
[]
[]
[null,null,"Datos de la solicitud"]
[null,null,"TIPO DE PRODUCTO:","CRÉDITO HIPOTECARIO MIFEL + CUENTA INFONAVIT"]
[null,null,"FECHA:",{"$f":"TODAY()","v":"2024-04-03"}]
[null,null,"NOMBRE DEL SOLICITANTE:"]
[null,null,"EDAD (AÑOS):",null,null,"ERES ASALARIADO:"]
[]
[]
[null,null,"Datos del Crédito",null,null,"Gastos Iniciales"]
[null,null,"TIPO DE PRODUCTO:",null,null,"ENGANCHE:",{"$f":"IFERROR(IF(D19=DATOS!A9,(D22-D23)/D22,D21),0)","v":0},{"$f":"IFERROR(IF(D19=\"VALOR VIVIENDA\",D22*D21,IF(D19=\"MONTO CRÉDITO\",D22*G18,D22*D21))-D26,\"\")","v":0}]
[null,null,"COTIZAR POR:",null,null,"COMISIÓN POR APERTURA MIFEL:",{"$f":"IFERROR(IF(OR(D18=\"SIN_COMISIONES\",D18=\"HIPOTECA_VERDE\"),0,(D34*0.7%)),\"\")","v":0}]
[null,null,"PLAZO DE CRÉDITO:",null,null,"COMISIÓN POR APERTURA INFONAVIT:",{"$f":"IFERROR((D35*1%),\"\")","v":0}]
[null,null,"%ENGANCHE:",null,null,"GASTOS NOTARIALES:",null,{"$f":"IF(D22*G21<=0,0,D22*G21)","v":0}]
[null,null,"VALOR DE LA VIVIENDA:",null,null,"GASTO DE APROBACIÓN:",{"$f":"IF(G28=\"\",0,IF(D18=\"SIN_COMISIONES\",0,DATOS!S5))","v":0}]
[null,null,{"$f":"IF(D19=\"VALOR VIVIENDA\",\"\",IF(D19=\"INGRESOS\",\"INGRESO MENSUAL (BRUTO):\",IF(D19=\"MONTO CRÉDITO\",\"MONTO DEL CRÉDITO:\",\"\")))","v":""},null,null,"AVALÚO:"]
[null,null,"PAGO DE OBLIGACIONES:",null,null,"DESEMBOLSO INICIAL:",{"$f":"IFERROR(H18+G19+G20+H21+G22+G23,\"\")","v":0}]
[]
[null,null,"SALDO SUBCUENTA DE VIVIENDA:",null,null,"Condiciones del Crédito"]
[null,null,null,null,null,"MONTO DEL CRÉDITO:",{"$f":"IFERROR(IF(D19=\"VALOR VIVIENDA\",D22-(D22*D21),IF(D19=\"MONTO CRÉDITO\",D23,IF(D19=\"INGRESOS\",MIN(G31,(IF(D26>D22,D22,G31)),(D22*85%)),0))),\"\")","v":0}]
[null,null,"INGRESO REQUERIDO MENSUAL:",{"$f":"IF(D19=\"INGRESOS\",35000,((F34+F35)*3))","v":0},null,"TASA MIFEL:",{"$f":"IF(OR(G14=\"SI*\",D20=\"\"),\"\",DATOS!N2)","v":""}]
[null,null,null,null,null,"PAGO MENSUAL MIFEL:",{"$f":"IFERROR((G27-D35)*((((1+(G28/12))^(D20*12))*(G28/12))/(((1+(G28/12))^(D20*12))-1)),0)","v":0}]
[null,null,{"$f":"+IF(AND(G27<600000,G27<>0),\"*El monto mínimo de crédito es de $600,000.00\",\"\")","v":""},null,null,"CAT MIFEL:",{"$f":"IFERROR(((1+IRR('AMORTIZACIÓN MIFEL'!Y7:Y248))^(12))-1,0)","v":0}]
{"$rows_left_out":9}
{"sheet":"DATOS","index":1,"n_rows":32,"n_cols":24,"rows_kept":32,"cut":false,"hidden":true,"merged":[[1,2,1,4],[1,14,1,15],[0,0,0,8],[0,17,0,18],[9,17,9,18],[0,14,0,15]]}
["VARIABLES",null,null,null,null,null,null,null,null,null,"AÑOS","INT","ENG","TASA","TASA FINAL",null,null,"CONDICIONES MIFEL",null,null,"HIP_VERDE","HIP_VERDE"]
["CANAL CRÉDITO",null,"ENGANCHE",null,null,null,"PLAZO",null,"NOTARIO",null,{"$f":"'SIMULADOR VF'!D20","v":0},{"$f":"+IF(AND($M$2>=D4,$M$2<=E4),L5,IF(AND($M$2>=D5,$M$2<=E5),M5,IF(AND($M$2>=D6,$M$2<=E6),N5,IF(AND($M$2>=D7,$M$2<=E7),O5,IF(AND($M$2>=D8,$M$2<=E8),P5,\"\")))))","v":""},{"$f":"IF('SIMULADOR VF'!D19=DATOS!A9,'SIMULADOR VF'!G18,'SIMULADOR VF'!D21)","v":0},{"$f":"IFERROR(IF('SIMULADOR VF'!D18=\"HIPOTECA_VERDE\",VLOOKUP(CONCATENATE(\"HIP_VERDE\"&DATOS!K2&DATOS!L2),U1:V32,2,0),IF('SIMULADOR VF'!D18=\"SIN_COMISIONES\",VLOOKUP(CONCATENATE(\"SIN_COMISIONES\"&DATOS!K2&DATOS!L2),U1:V32,2,0),HLOOKUP(MATCH(L2,L5:P5,0),K5:P8,MATCH(K2,K5:K8,0),0))),0)","v":0},{"$f":"IFERROR((70%*$N$2)+(30%*10.45%),0)","v":3.1349999999999996E-2},null,null,"SEGURO DE VIDA",0.46679999999999999,null,"HIP_VERDE101",9.7000000000000003E-2,"10%-14%",10]
["BANCA PRIVADA DESARROLLADORES",null,null,null,null,null,10,null,0.02,null,null,null,null,{"$f":"IF('SIMULADOR VF'!D18=\"HIPOTECA_VERDE\",VLOOKUP(CONCATENATE(\"HIP_VERDE\"&DATOS!K2&DATOS!L2),U1:V32,2,0))","v":false},null,null,null,"SEGURO DE DAÑOS",9.8000000000000004E-2,null,"HIP_VERDE102",9.7000000000000003E-2,"15%-19%",10]
["BROKER",null,1,0.1,0.14000000000000001,null,15,null,0.03,null,null,null,null,null,null,null,null,"COMISIÓN MENSUAL",{"$f":"IF('SIMULADOR VF'!D18=\"SIN_COMISIONES\",0,399)","v":399},null,"HIP_VERDE103",9.7000000000000003E-2,"20%-24%",10]
["SUCURSAL",null,2,0.15,0.19,null,20,null,0.04,null,null,1,2,3,4,5,null,"GASTO APROBACIÓN",928,null,"HIP_VERDE104",9.7000000000000003E-2,"25%-29%",10]
[null,null,3,0.2,0.24,null,null,null,0.05,null,10,0.1067,0.1057,0.10489999999999999,0.10290000000000001,9.4100000000000003E-2,null,"COMISIÓN POR APERTURA",{"$f":"+'SIMULADOR VF'!G19","v":0},null,"HIP_VERDE105",9.4100000000000003E-2,">30%",10]
["COTIZACION",null,4,0.25,0.28999999999999998,null,null,null,0.06,null,15,0.10970000000000001,0.1082,0.1079,0.10589999999999999,9.9900000000000003E-2,null,"INGRESOS MÍNIMOS",34000,null,"HIP_VERDE151",9.7000000000000003E-2,"10%-14%",15]
["VALOR VIVIENDA",null,5,0.3,1,null,null,null,7.0000000000000007E-2,null,20,0.1099,0.1094,0.1089,0.1079,0.1048,null,null,null,null,"HIP_VERDE152",9.7000000000000003E-2,"15%-19%",15]
["MONTO CRÉDITO",null,null,null,null,null,null,null,0.08,null,null,null,null,null,null,null,null,null,null,null,"HIP_VERDE153",9.7000000000000003E-2,"20%-24%",15]
["INGRESOS",null,null,null,null,null,null,null,0.09,null,null,null,null,null,null,null,null,"COSTOS INFONAVIT",null,null,"HIP_VERDE154",9.7000000000000003E-2,"25%-29%",15]
[null,null,null,"SI*",null,null,null,null,0.1,null,null,null,null,null,null,null,null,"COMISIÓN POR APERTURA",0.01,null,"HIP_VERDE155",9.4100000000000003E-2,">30%",15]
["PREPAGO",null,null,"NO",null,null,null,null,null,null,null,null,null,null,null,null,null,null,null,null,"HIP_VERDE201",9.7000000000000003E-2,"10%-14%",20]
["NO APLICA",null,null,null,null,null,null,null,null,null,null,null,null,null,null,null,null,null,null,null,"HIP_VERDE202",9.7000000000000003E-2,"15%-19%",20]
["REDUCCIÓN PLAZO",null,null,null,null,null,null,null,null,null,null,null,null,null,null,null,null,"CAPACIDAD MENSUAL",{"$f":"('SIMULADOR VF'!D23*S16)-'SIMULADOR VF'!D24","v":0},null,"HIP_VERDE203",9.7000000000000003E-2,"20%-24%",20]
["REDUCCIÓN CAPITAL",null,null,null,null,null,null,null,null,null,null,null,null,null,null,null,null,"FACTOR DE LÍNEA",{"$f":"IFERROR(PMT(S17/12,K2*12,-1000)+S2+S3,0)","v":0},null,"HIP_VERDE204",9.7000000000000003E-2,"25%-29%",20]
[null,null,null,null,null,null,null,null,null,null,null,null,null,null,null,null,null,"FACTOR DTI",0.65,null,"HIP_VERDE205",9.4100000000000003E-2,">30%",20]
["TIPO DE CRÉDITO",null,null,null,null,null,null,null,null,null,null,null,null,null,null,null,null,"TASA PONDERADA",{"$f":"+O2","v":3.1349999999999996E-2},null,"SIN_COMISIONES","HIP_VERDE"]
["TRADICIONAL",null,null,null,null,null,null,null,null,null,null,null,null,null,null,null,null,null,null,null,"SIN_COMISIONES101",0.1125,"10%-14%",10]
["HIPOTECA_VERDE",null,null,null,null,null,null,null,null,null,null,null,null,null,null,null,null,null,null,null,"SIN_COMISIONES102",0.1125,"15%-19%",10]
["SIN_COMISIONES",null,null,null,null,null,null,null,null,null,null,null,null,null,null,null,null,null,null,null,"SIN_COMISIONES103",0.111,"20%-24%",10]
[null,null,null,null,null,null,null,null,null,null,null,null,null,null,null,null,null,null,null,null,"SIN_COMISIONES104",0.111,"25%-29%",10]
[null,null,null,null,null,null,null,null,null,null,null,null,null,null,null,null,null,null,null,null,"SIN_COMISIONES105",0.11,">30%",10]
[null,null,null,null,null,null,null,null,null,null,null,null,null,null,null,null,null,null,null,null,"SIN_COMISIONES151",0.1125,"10%-14%",15]
[null,null,null,null,null,null,null,null,null,null,null,null,null,null,null,null,null,null,null,null,"SIN_COMISIONES152",0.1125,"15%-19%",15]
[null,null,null,null,null,null,null,null,null,null,null,null,null,null,null,null,null,null,null,null,"SIN_COMISIONES153",0.111,"20%-24%",15]
[null,null,null,null,null,null,null,null,null,null,null,null,null,null,null,null,null,null,null,null,"SIN_COMISIONES154",0.111,"25%-29%",15]
[null,null,null,null,null,null,null,null,null,null,null,null,null,null,null,null,null,null,null,null,"SIN_COMISIONES155",0.11,">30%",15]
[null,null,null,null,null,null,null,null,null,null,null,null,null,null,null,null,null,null,null,null,"SIN_COMISIONES201",0.1125,"10%-14%",20]
[null,null,null,null,null,null,null,null,null,null,null,null,null,null,null,null,null,null,null,null,"SIN_COMISIONES202",0.1125,"15%-19%",20]
[null,null,null,null,null,null,null,null,null,null,null,null,null,null,null,null,null,null,null,null,"SIN_COMISIONES203",0.111,"20%-24%",20]
{"$rows_left_out":3}
{"sheet":"AMORTIZACIÓN MIFEL","index":2,"n_rows":249,"n_cols":31,"rows_kept":249,"cut":false,"hidden":false,"merged":[[2,5,2,8],[3,3,4,8]]}
[null," ",null," ",null,null,null,null,null,null,null,null,null,null,null,null,null,null,null,null,null,null,null,{"$f":"AB46-I46","v":{"$error":"#VALUE!"}}]
[null,null,null,null,null,null,null,null,null,null,"PREPAGO:"]
[]
[null,null,null,{"$f":"+TEXT('SIMULADOR VF'!D13,\"\")","v":""},null,null,null,null,null,"  Plazo:",{"$f":"+'SIMULADOR VF'!D20","v":0}]
[null,"Acreditado:",null,null,null,null,null,null,null,"Fecha :",{"$f":"TODAY()","v":"2024-04-03"}]
[]
[null,"PERIODO",null,"TASA DE INTERÉS","SALDO INSOLUTO","COMISIÓN","PAGOS MENSUALES",null,"INTERESES GENERADOS","AMORTIZACIÓN","SALDO FINAL",null,"ABONO A CAPITAL",null,null,"COMISIÓN POR ADMINISTRACION","PRIMA      VIDA","PRIMA DAÑOS","PAGO MENSUAL (AMORTIZACIÓN, INTERESES Y SEGUROS)","APORTACIONES INFONAVIT","INGRESOS MENSUALES","NO_GENERA_IVA",null,null,{"$f":"IF(E8=\"\",\"\",-E8+F8)","v":0},null,"PLAZO","CAPITAL","FINAL","PAGO","PLAZO"]
[null,0,null,null,{"$f":"'SIMULADOR VF'!D34","v":0},{"$f":"E8*DATOS!S6","v":0}]
[null,1,null,{"$f":"'SIMULADOR VF'!G34","v":""},{"$f":"E8","v":0},{"$f":"+K4*12","v":0},{"$f":"IFERROR(IF(B9=\"\",\"\",I9+J9),0)","v":0},null,{"$f":"IFERROR(E9*D9/12,\"\")","v":""},{"$f":"IF(I9=\"\",\"\",'SIMULADOR VF'!F34-I9)","v":""},{"$f":"IFERROR(E9-J9-T9,\"\")","v":""},null,0,{"$f":"$M$2","v":0},null,{"$f":"IF(B10=\"\",\"\",DATOS!$S$4)","v":""},{"$f":"IF(E9=\"\",\"\",E9*DATOS!$S$2/1000)","v":0},{"$f":"IFERROR(E9*DATOS!$S$3/1000,\"\")","v":0},{"$f":"IFERROR(G9+P9+Q9+R9+V9,\"\")","v":""},0,0,0,null,{"$f":"+IFERROR(G9/E9,0)","v":0},{"$f":"IFERROR(IF(B9=\"\",\"\",S9+T9),0)","v":0},{"$f":"IFERROR(IF(E9=\"\",\"\",(S9-M9)),0)","v":0},{"$f":"IF($M$2=DATOS!$A$14,1,0)","v":0},{"$f":"IF($M$2=DATOS!$A$15,1,0)","v":0},{"$f":"IF(SUM(AA9:AB9)=0,'SIMULADOR VF'!$F$34,AD9*AB9+AE9*AA9)","v":0},{"$f":"IFERROR(PMT($D$9/12,$F$9-B8,-E9),0)","v":0},{"$f":"AD9","v":0}]
[null,{"$f":"IF(E10=\"\",\"\",IF(B9>=$F$9,\"\",B9+1))","v":""},null,{"$f":"IF(B10=\"\",\"\",D9)","v":""},{"$f":"IFERROR(IF(K9=0,\"\",K9-IF(N9=\"NO APLICA\",0,M9)),\"\")","v":""},{"$f":"IF(E10=\"\",\"\",F9-1)","v":""},{"$f":"IF(B10=\"\",\"\",I10+J10)","v":""},null,{"$f":"IFERROR(E10*D10/12,\"\")","v":""},{"$f":"IF(B10=\"\",\"\",IF(K9<AC10-I10,K9,AC10-I10))","v":""},"",null,{"$f":"IF(B10=\"\",\"\",0)","v":""},{"$f":"$M$2","v":0},null,{"$f":"IF(B10=\"\",\"\",IF(E10>0,$P$9,0))","v":""},{"$f":"IF(B10=\"\",\"\",E10*DATOS!$S$2/1000)","v":""},{"$f":"IF(B10=\"\",\"\",E10*DATOS!$S$3/1000)","v":""},"",0,null,0,null,{"$f":"+X9*3.33","v":0},"",{"$f":"IF(B10=\"\",\"\",(S10-M10))","v":""},{"$f":"IF($M$2=DATOS!$A$14,1,0)","v":0},{"$f":"IF($M$2=DATOS!$A$15,1,0)","v":0},{"$f":"IF(SUM(AA10:AB10)=0,'SIMULADOR VF'!$F$34,AD10*AB10+AE10*AA10)","v":0},0,{"$f":"AC9","v":0}]
[null,{"$f":"IF(E11=\"\",\"\",IF(B10>=$F$9,\"\",B10+1))","v":""},null,{"$f":"IF(B11=\"\",\"\",D10)","v":""},{"$f":"IFERROR(IF(K10=0,\"\",K10-IF(N10=\"NO APLICA\",0,M10)),\"\")","v":""},{"$f":"IF(E11=\"\",\"\",F10-1)","v":""},{"$f":"IF(B11=\"\",\"\",I11+J11)","v":""},null,{"$f":"IFERROR(E11*D11/12,\"\")","v":""},"","",null,{"$f":"IF(B11=\"\",\"\",0)","v":""},0,null,{"$f":"IF(B11=\"\",\"\",IF(E11>0,$P$9,0))","v":""},{"$f":"IF(B11=\"\",\"\",E11*DATOS!$S$2/1000)","v":""},{"$f":"IF(B11=\"\",\"\",E11*DATOS!$S$3/1000)","v":""},"",0,null,0,null,null,"","",{"$f":"IF($M$2=DATOS!$A$14,1,0)","v":0},{"$f":"IF($M$2=DATOS!$A$15,1,0)","v":0},{"$f":"IF(SUM(AA11:AB11)=0,'SIMULADOR VF'!$F$34,AD11*AB11+AE11*AA11)","v":0},0,{"$f":"AC10","v":0}]
[null,"",null,{"$f":"IF(B12=\"\",\"\",D11)","v":""},"",{"$f":"IF(E12=\"\",\"\",F11-1)","v":""},"",null,{"$f":"IFERROR(E12*D12/12,\"\")","v":""},"","",null,"",0,null,"",{"$f":"IF(B12=\"\",\"\",E12*DATOS!$S$2/1000)","v":""},{"$f":"IF(B12=\"\",\"\",E12*DATOS!$S$3/1000)","v":""},"",0,null,0,null,null,"","",{"$f":"IF($M$2=DATOS!$A$14,1,0)","v":0},{"$f":"IF($M$2=DATOS!$A$15,1,0)","v":0},{"$f":"IF(SUM(AA12:AB12)=0,'SIMULADOR VF'!$F$34,AD12*AB12+AE12*AA12)","v":0},0,0]
[null,"",null,"","","",{"$f":"IF(B13=\"\",\"\",I13+J13)","v":""},null,{"$f":"IFERROR(E13*D13/12,\"\")","v":""},"","",null,"",0,null,"",{"$f":"IF(B13=\"\",\"\",E13*DATOS!$S$2/1000)","v":""},{"$f":"IF(B13=\"\",\"\",E13*DATOS!$S$3/1000)","v":""},"",0,null,0,null,null,"","",{"$f":"IF($M$2=DATOS!$A$14,1,0)","v":0},{"$f":"IF($M$2=DATOS!$A$15,1,0)","v":0},{"$f":"IF(SUM(AA13:AB13)=0,'SIMULADOR VF'!$F$34,AD13*AB13+AE13*AA13)","v":0},0,0]
[null,"",null,"","",{"$f":"IF(E14=\"\",\"\",F13-1)","v":""},"",null,"","","",null,"",0,null,"",{"$f":"IF(B14=\"\",\"\",E14*DATOS!$S$2/1000)","v":""},{"$f":"IF(B14=\"\",\"\",E14*DATOS!$S$3/1000)","v":""},"",0,null,0,null,null,"","",{"$f":"IF($M$2=DATOS!$A$14,1,0)","v":0},{"$f":"IF($M$2=DATOS!$A$15,1,0)","v":0},{"$f":"IF(SUM(AA14:AB14)=0,'SIMULADOR VF'!$F$34,AD14*AB14+AE14*AA14)","v":0},0,0]
[null,"",null,"","","","",null,"","","",null,"",0,null,"",{"$f":"IF(B15=\"\",\"\",E15*DATOS!$S$2/1000)","v":""},{"$f":"IF(B15=\"\",\"\",E15*DATOS!$S$3/1000)","v":""},"",0,null,0,null,null,"","",{"$f":"IF($M$2=DATOS!$A$14,1,0)","v":0},{"$f":"IF($M$2=DATOS!$A$15,1,0)","v":0},{"$f":"IF(SUM(AA15:AB15)=0,'SIMULADOR VF'!$F$34,AD15*AB15+AE15*AA15)","v":0},0,0]
[null,"",null,"","","","",null,"","","",null,"",0,null,"",{"$f":"IF(B16=\"\",\"\",E16*DATOS!$S$2/1000)","v":""},{"$f":"IF(B16=\"\",\"\",E16*DATOS!$S$3/1000)","v":""},"",0,null,0,null,null,"","",{"$f":"IF($M$2=DATOS!$A$14,1,0)","v":0},{"$f":"IF($M$2=DATOS!$A$15,1,0)","v":0},{"$f":"IF(SUM(AA16:AB16)=0,'SIMULADOR VF'!$F$34,AD16*AB16+AE16*AA16)","v":0},0,0]
[null,"",null,"","","","",null,"","","",null,"",0,null,"",{"$f":"IF(B17=\"\",\"\",E17*DATOS!$S$2/1000)","v":""},{"$f":"IF(B17=\"\",\"\",E17*DATOS!$S$3/1000)","v":""},"",0,null,0,null,null,"","",{"$f":"IF($M$2=DATOS!$A$14,1,0)","v":0},{"$f":"IF($M$2=DATOS!$A$15,1,0)","v":0},{"$f":"IF(SUM(AA17:AB17)=0,'SIMULADOR VF'!$F$34,AD17*AB17+AE17*AA17)","v":0},0,0]
[null,"",null,"","","","",null,"","","",null,"",0,null,"",{"$f":"IF(B18=\"\",\"\",E18*DATOS!$S$2/1000)","v":""},{"$f":"IF(B18=\"\",\"\",E18*DATOS!$S$3/1000)","v":""},"",0,null,0,null,null,"","",{"$f":"IF($M$2=DATOS!$A$14,1,0)","v":0},{"$f":"IF($M$2=DATOS!$A$15,1,0)","v":0},{"$f":"IF(SUM(AA18:AB18)=0,'SIMULADOR VF'!$F$34,AD18*AB18+AE18*AA18)","v":0},0,0]
[null,"",null,"","","","",null,"","","",null,"",0,null,"",{"$f":"IF(B19=\"\",\"\",E19*DATOS!$S$2/1000)","v":""},{"$f":"IF(B19=\"\",\"\",E19*DATOS!$S$3/1000)","v":""},"",0,null,0,null,null,"","",{"$f":"IF($M$2=DATOS!$A$14,1,0)","v":0},{"$f":"IF($M$2=DATOS!$A$15,1,0)","v":0},{"$f":"IF(SUM(AA19:AB19)=0,'SIMULADOR VF'!$F$34,AD19*AB19+AE19*AA19)","v":0},0,0]
[null,"",null,"","","","",null,"","","",null,"",0,null,"",{"$f":"IF(B20=\"\",\"\",E20*DATOS!$S$2/1000)","v":""},{"$f":"IF(B20=\"\",\"\",E20*DATOS!$S$3/1000)","v":""},"",0,null,0,null,null,"","",{"$f":"IF($M$2=DATOS!$A$14,1,0)","v":0},{"$f":"IF($M$2=DATOS!$A$15,1,0)","v":0},{"$f":"IF(SUM(AA20:AB20)=0,'SIMULADOR VF'!$F$34,AD20*AB20+AE20*AA20)","v":0},0,0]
[null,"",null,"","","","",null,"","","",null,"",0,null,"",{"$f":"IF(B21=\"\",\"\",E21*DATOS!$S$2/1000)","v":""},{"$f":"IF(B21=\"\",\"\",E21*DATOS!$S$3/1000)","v":""},"",0,null,0,null,null,"","",{"$f":"IF($M$2=DATOS!$A$14,1,0)","v":0},{"$f":"IF($M$2=DATOS!$A$15,1,0)","v":0},{"$f":"IF(SUM(AA21:AB21)=0,'SIMULADOR VF'!$F$34,AD21*AB21+AE21*AA21)","v":0},0,0]
[null,"",null,"","","","",null,"","","",null,"",0,null,"",{"$f":"IF(B22=\"\",\"\",E22*DATOS!$S$2/1000)","v":""},{"$f":"IF(B22=\"\",\"\",E22*DATOS!$S$3/1000)","v":""},"",0,null,0,null,null,"","",{"$f":"IF($M$2=DATOS!$A$14,1,0)","v":0},{"$f":"IF($M$2=DATOS!$A$15,1,0)","v":0},{"$f":"IF(SUM(AA22:AB22)=0,'SIMULADOR VF'!$F$34,AD22*AB22+AE22*AA22)","v":0},0,0]
[null,"",null,"","","","",null,"","","",null,"",0,null,"",{"$f":"IF(B23=\"\",\"\",E23*DATOS!$S$2/1000)","v":""},{"$f":"IF(B23=\"\",\"\",E23*DATOS!$S$3/1000)","v":""},"",0,null,0,null,null,"","",{"$f":"IF($M$2=DATOS!$A$14,1,0)","v":0},{"$f":"IF($M$2=DATOS!$A$15,1,0)","v":0},{"$f":"IF(SUM(AA23:AB23)=0,'SIMULADOR VF'!$F$34,AD23*AB23+AE23*AA23)","v":0},0,0]
[null,"",null,"","","","",null,"","","",null,"",0,null,"",{"$f":"IF(B24=\"\",\"\",E24*DATOS!$S$2/1000)","v":""},{"$f":"IF(B24=\"\",\"\",E24*DATOS!$S$3/1000)","v":""},"",0,null,0,null,null,"","",{"$f":"IF($M$2=DATOS!$A$14,1,0)","v":0},{"$f":"IF($M$2=DATOS!$A$15,1,0)","v":0},{"$f":"IF(SUM(AA24:AB24)=0,'SIMULADOR VF'!$F$34,AD24*AB24+AE24*AA24)","v":0},0,0]
[null,"",null,"","","","",null,"","","",null,"",0,null,"",{"$f":"IF(B25=\"\",\"\",E25*DATOS!$S$2/1000)","v":""},{"$f":"IF(B25=\"\",\"\",E25*DATOS!$S$3/1000)","v":""},"",0,null,0,null,null,"","",{"$f":"IF($M$2=DATOS!$A$14,1,0)","v":0},{"$f":"IF($M$2=DATOS!$A$15,1,0)","v":0},{"$f":"IF(SUM(AA25:AB25)=0,'SIMULADOR VF'!$F$34,AD25*AB25+AE25*AA25)","v":0},0,0]
[null,"",null,"","","","",null,"","","",null,"",0,null,"",{"$f":"IF(B26=\"\",\"\",E26*DATOS!$S$2/1000)","v":""},{"$f":"IF(B26=\"\",\"\",E26*DATOS!$S$3/1000)","v":""},"",0,null,0,null,null,"","",{"$f":"IF($M$2=DATOS!$A$14,1,0)","v":0},{"$f":"IF($M$2=DATOS!$A$15,1,0)","v":0},{"$f":"IF(SUM(AA26:AB26)=0,'SIMULADOR VF'!$F$34,AD26*AB26+AE26*AA26)","v":0},0,0]
[null,"",null,"","","","",null,"","","",null,"",0,null,"",{"$f":"IF(B27=\"\",\"\",E27*DATOS!$S$2/1000)","v":""},{"$f":"IF(B27=\"\",\"\",E27*DATOS!$S$3/1000)","v":""},"",0,null,0,null,null,"","",{"$f":"IF($M$2=DATOS!$A$14,1,0)","v":0},{"$f":"IF($M$2=DATOS!$A$15,1,0)","v":0},{"$f":"IF(SUM(AA27:AB27)=0,'SIMULADOR VF'!$F$34,AD27*AB27+AE27*AA27)","v":0},0,0]
[null,"",null,"","","","",null,"","","",null,"",0,null,"",{"$f":"IF(B28=\"\",\"\",E28*DATOS!$S$2/1000)","v":""},{"$f":"IF(B28=\"\",\"\",E28*DATOS!$S$3/1000)","v":""},"",0,null,0,null,null,"","",{"$f":"IF($M$2=DATOS!$A$14,1,0)","v":0},{"$f":"IF($M$2=DATOS!$A$15,1,0)","v":0},{"$f":"IF(SUM(AA28:AB28)=0,'SIMULADOR VF'!$F$34,AD28*AB28+AE28*AA28)","v":0},0,0]
[null,"",null,"","","","",null,"","","",null,"",0,null,"",{"$f":"IF(B29=\"\",\"\",E29*DATOS!$S$2/1000)","v":""},{"$f":"IF(B29=\"\",\"\",E29*DATOS!$S$3/1000)","v":""},"",0,null,0,null,null,"","",{"$f":"IF($M$2=DATOS!$A$14,1,0)","v":0},{"$f":"IF($M$2=DATOS!$A$15,1,0)","v":0},{"$f":"IF(SUM(AA29:AB29)=0,'SIMULADOR VF'!$F$34,AD29*AB29+AE29*AA29)","v":0},0,0]
[null,"",null,"","","","",null,"","","",null,"",0,null,"",{"$f":"IF(B30=\"\",\"\",E30*DATOS!$S$2/1000)","v":""},{"$f":"IF(B30=\"\",\"\",E30*DATOS!$S$3/1000)","v":""},"",0,null,0,null,null,"","",{"$f":"IF($M$2=DATOS!$A$14,1,0)","v":0},{"$f":"IF($M$2=DATOS!$A$15,1,0)","v":0},{"$f":"IF(SUM(AA30:AB30)=0,'SIMULADOR VF'!$F$34,AD30*AB30+AE30*AA30)","v":0},0,0]
{"$rows_left_out":220}
{"sheet":"AMORTIZACIÓN INFONAVIT","index":3,"n_rows":249,"n_cols":22,"rows_kept":249,"cut":false,"hidden":false,"merged":[[2,5,2,8],[3,3,4,8]]}
[null," ",null," ",null,null,null,null,null,null,null,null,null,null,{"$f":"S46-I46","v":{"$error":"#VALUE!"}}]
[]
[]
[null,null,null,{"$f":"+TEXT('SIMULADOR VF'!D13,\"\")","v":""},null,null,null,null,null,"  Plazo:",{"$f":"+'SIMULADOR VF'!D20","v":0}]
[null,"Acreditado:",null,null,null,null,null,null,null,"Fecha :",{"$f":"TODAY()","v":"2024-04-03"}]
[]
[null,"PERIODO",null,"TASA DE INTERÉS","SALDO INSOLUTO","COMISIÓN","PAGOS MENSUALES",null,"INTERESES GENERADOS","AMORTIZACIÓN","SALDO FINAL","COMISIÓN POR ADMINISTRACION","PAGO MENSUAL (AMORTIZACIÓN, INTERESES Y SEGUROS)",null,null,{"$f":"IF(E8=\"\",\"\",-E8+F8)","v":0},null,"PLAZO","CAPITAL","FINAL","PAGO","PLAZO"]
[null,0,null,null,{"$f":"'SIMULADOR VF'!D35","v":0},{"$f":"E8*DATOS!S11","v":0}]
[null,1,null,{"$f":"'SIMULADOR VF'!G35","v":""},{"$f":"E8","v":0},{"$f":"+K4*12","v":0},{"$f":"IFERROR(IF(B9=\"\",\"\",I9+J9),0)","v":0},null,{"$f":"IFERROR(E9*D9/12,\"\")","v":""},{"$f":"IF(I9=\"\",\"\",'SIMULADOR VF'!F35-I9)","v":""},{"$f":"IFERROR(E9-J9,\"\")","v":""},{"$f":"IF(B9=\"\",\"\",E9*(1%/12))","v":0},{"$f":"IFERROR(G9+L9,\"\")","v":0},{"$f":"+IFERROR(G9/E9,0)","v":0},null,{"$f":"IFERROR(IF(B9=\"\",\"\",M9),0)","v":0},{"$f":"IFERROR(IF(E9=\"\",\"\",M9),0)","v":0},0,0,{"$f":"IF(SUM(R9:S9)=0,'SIMULADOR VF'!$F$35,U9*S9+V9*R9)","v":0},{"$f":"IFERROR(PMT($D$9/12,$F$9-B8,-E9),0)","v":0},{"$f":"U9","v":0}]
[null,{"$f":"IF(E10=\"\",\"\",IF(B9>=$F$9,\"\",B9+1))","v":""},null,{"$f":"IF(B10=\"\",\"\",D9)","v":""},{"$f":"IFERROR(IF(K9=0,\"\",K9),\"\")","v":""},{"$f":"IF(E10=\"\",\"\",F9-1)","v":""},{"$f":"IF(B10=\"\",\"\",I10+J10)","v":""},null,{"$f":"IFERROR(E10*D10/12,\"\")","v":""},{"$f":"IF(B10=\"\",\"\",IF(K9<T10-I10,K9,T10-I10))","v":""},{"$f":"IFERROR(E10-J10,\"\")","v":""},{"$f":"IF(B10=\"\",\"\",IF(E10>0,E10*(1%/12)))","v":""},"",{"$f":"+N9*3.33","v":0},null,"",{"$f":"IF(B10=\"\",\"\",M10)","v":""},0,0,{"$f":"IF(SUM(R10:S10)=0,'SIMULADOR VF'!$F$35,U10*S10+V10*R10)","v":0},0,{"$f":"T9","v":0}]
[null,{"$f":"IF(E11=\"\",\"\",IF(B10>=$F$9,\"\",B10+1))","v":""},null,{"$f":"IF(B11=\"\",\"\",D10)","v":""},{"$f":"IFERROR(IF(K10=0,\"\",K10),\"\")","v":""},{"$f":"IF(E11=\"\",\"\",F10-1)","v":""},{"$f":"IF(B11=\"\",\"\",I11+J11)","v":""},null,{"$f":"IFERROR(E11*D11/12,\"\")","v":""},"",{"$f":"IFERROR(E11-J11,\"\")","v":""},{"$f":"IF(B11=\"\",\"\",IF(E11>0,E11*(1%/12)))","v":""},"",null,null,"","",0,0,{"$f":"IF(SUM(R11:S11)=0,'SIMULADOR VF'!$F$35,U11*S11+V11*R11)","v":0},0,{"$f":"T10","v":0}]
[null,"",null,{"$f":"IF(B12=\"\",\"\",D11)","v":""},"","",{"$f":"IF(B12=\"\",\"\",I12+J12)","v":""},null,{"$f":"IFERROR(E12*D12/12,\"\")","v":""},"","",{"$f":"IF(B12=\"\",\"\",IF(E12>0,E12*(1%/12)))","v":""},"",null,null,"","",0,0,{"$f":"IF(SUM(R12:S12)=0,'SIMULADOR VF'!$F$35,U12*S12+V12*R12)","v":0},0,0]
[null,"",null,"","","",{"$f":"IF(B13=\"\",\"\",I13+J13)","v":""},null,{"$f":"IFERROR(E13*D13/12,\"\")","v":""},"","","","",null,null,"","",0,0,{"$f":"IF(SUM(R13:S13)=0,'SIMULADOR VF'!$F$35,U13*S13+V13*R13)","v":0},0,0]
[null,"",null,"","",{"$f":"IF(E14=\"\",\"\",F13-1)","v":""},"",null,"","","","","",null,null,"","",0,0,{"$f":"IF(SUM(R14:S14)=0,'SIMULADOR VF'!$F$35,U14*S14+V14*R14)","v":0},0,0]
[null,"",null,"","","","",null,"","",{"$f":"IFERROR(E15-J15,\"\")","v":""},"","",null,null,"","",0,0,{"$f":"IF(SUM(R15:S15)=0,'SIMULADOR VF'!$F$35,U15*S15+V15*R15)","v":0},0,0]
[null,"",null,"","","","",null,"","","","","",null,null,"","",0,0,{"$f":"IF(SUM(R16:S16)=0,'SIMULADOR VF'!$F$35,U16*S16+V16*R16)","v":0},0,0]
[null,"",null,"","","","",null,"","","","","",null,null,"","",0,0,{"$f":"IF(SUM(R17:S17)=0,'SIMULADOR VF'!$F$35,U17*S17+V17*R17)","v":0},0,0]
[null,"",null,"","","","",null,"","","","","",null,null,"","",0,0,{"$f":"IF(SUM(R18:S18)=0,'SIMULADOR VF'!$F$35,U18*S18+V18*R18)","v":0},0,0]
[null,"",null,"",{"$f":"IFERROR(IF(K18=0,\"\",K18),\"\")","v":""},"","",null,"","","","","",null,null,"","",0,0,{"$f":"IF(SUM(R19:S19)=0,'SIMULADOR VF'!$F$35,U19*S19+V19*R19)","v":0},0,0]
[null,"",null,"","","","",null,"","","","","",null,null,"","",0,0,{"$f":"IF(SUM(R20:S20)=0,'SIMULADOR VF'!$F$35,U20*S20+V20*R20)","v":0},0,0]
[null,"",null,"","","","",null,"","","","","",null,null,"","",0,0,{"$f":"IF(SUM(R21:S21)=0,'SIMULADOR VF'!$F$35,U21*S21+V21*R21)","v":0},0,0]
[null,"",null,"","","","",null,"","","","","",null,null,"","",0,0,{"$f":"IF(SUM(R22:S22)=0,'SIMULADOR VF'!$F$35,U22*S22+V22*R22)","v":0},0,0]
[null,"",null,"","","","",null,"","","","","",null,null,"","",0,0,{"$f":"IF(SUM(R23:S23)=0,'SIMULADOR VF'!$F$35,U23*S23+V23*R23)","v":0},0,0]
[null,"",null,"","","","",null,"","","","","",null,null,"","",0,0,{"$f":"IF(SUM(R24:S24)=0,'SIMULADOR VF'!$F$35,U24*S24+V24*R24)","v":0},0,0]
[null,"",null,"","","","",null,"","","","","",null,null,"","",0,0,{"$f":"IF(SUM(R25:S25)=0,'SIMULADOR VF'!$F$35,U25*S25+V25*R25)","v":0},0,0]
[null,"",null,"","","","",null,"","","","","",null,null,"","",0,0,{"$f":"IF(SUM(R26:S26)=0,'SIMULADOR VF'!$F$35,U26*S26+V26*R26)","v":0},0,0]
[null,"",null,"","","","",null,"","","","","",null,null,"","",0,0,{"$f":"IF(SUM(R27:S27)=0,'SIMULADOR VF'!$F$35,U27*S27+V27*R27)","v":0},0,0]
[null,"",null,"","","","",null,"","","","","",null,null,"","",0,0,{"$f":"IF(SUM(R28:S28)=0,'SIMULADOR VF'!$F$35,U28*S28+V28*R28)","v":0},0,0]
[null,"",null,"","","","",null,"","","","","",null,null,"","",0,0,{"$f":"IF(SUM(R29:S29)=0,'SIMULADOR VF'!$F$35,U29*S29+V29*R29)","v":0},0,0]
[null,"",null,"","","","",null,"","","","","",null,null,"","",0,0,{"$f":"IF(SUM(R30:S30)=0,'SIMULADOR VF'!$F$35,U30*S30+V30*R30)","v":0},0,0]
{"$rows_left_out":219}