{"text_format":"1","workbook":"xlsx","n_sheets":4,"sheets":["Tablas","Adm","Captura","CAT"],"not_rendered":{"charts":0,"images":4,"macros":1,"external_links":1,"defined_names":4,"comments":0,"pivot_tables":0},"unopened":[],"bounds":{"document_bytes":16777216,"sheet_cells":100000,"rows_first":2000,"rows_last":500,"rows_between":2000,"halvings":0,"cell_chars":16384,"cell_head_chars":4096},"cells_cut":0,"cells_raw":0,"read":"whole","date_system":"1900"}

{"sheet":"Tablas","index":0,"n_rows":93,"n_cols":35,"rows_kept":93,"cut":false,"hidden":true,"merged":[]}
[null,{"$f":"VLOOKUP(Captura!AF5,A4:F93,MATCH(Adm!$D$2,A3:F3,0),0)","v":{"$error":"#DIV/0!"}},null,null,null,null,null,null,{"$f":"VLOOKUP(Captura!AF5,H4:M93,MATCH(Adm!$D$2,H3:M3,0),0)","v":{"$error":"#DIV/0!"}},null,null,null,null,null,null,null,null,null,null,null,null,"Categoría","Rango de puntaje"]
["Pagos Congelados Tradicional SIN Subsidio",null,"Plazo (Años)",null,null,null,null,"Pagos Crecientes Tradicional sin Subsidio",null,"Plazo (Años)",null,null,null,null,null,null,null,null,null,null,null,null,1,2,3,4,5,6,7,8,9,10,11,12,13]
["% Crédito","% Cobertura",10,15,20,25,null,"% Crédito","% Cobertura",10,15,20,25,null,null,null,null,null,null,null,null,null,"0-349","350-400","401-450","451-500","501-550","551-600","601-650","651-700","701-750","751-800","801-850","851-900","901-1000"]
[0.01,0.3,1.2306086170414508E-2,1.7305494968732089E-2,2.1243237234385891E-2,2.4151436709004912E-2,null,0.01,0.3,1.2306086170414508E-2,1.7305494968732089E-2,2.1243237234385891E-2,2.4151436709004912E-2,null,null,null,null,null,null,null,null,"I",0,0,0,0,0,0,0,30,31,32,32,33,33]
[0.02,0.3,1.2306086170414508E-2,1.7305494968732089E-2,2.1243237234385891E-2,2.4151436709004912E-2,null,0.02,0.3,1.2306086170414508E-2,1.7305494968732089E-2,2.1243237234385891E-2,2.4151436709004912E-2,null,null,null,null,null,null,null,null,"II",0,0,0,29,30,30,31,31,32,32,33,33,34]
[0.03,0.3,1.2306086170414508E-2,1.7305494968732089E-2,2.1243237234385891E-2,2.4151436709004912E-2,null,0.03,0.3,1.2306086170414508E-2,1.7305494968732089E-2,2.1243237234385891E-2,2.4151436709004912E-2,null,null,null,null,null,null,null,null,"III",0,29,30,30,30,31,31,32,32,33,33,34,34]
[0.04,0.3,1.2306086170414508E-2,1.7305494968732089E-2,2.1243237234385891E-2,2.4151436709004912E-2,null,0.04,0.3,1.2306086170414508E-2,1.7305494968732089E-2,2.1243237234385891E-2,2.4151436709004912E-2,null,null,null,null,null,null,null,null,"Reserva Territorial",0,25,25,25,25,25,0,0,0,0,0,0,0]
[0.05,0.3,1.2306086170414508E-2,1.7305494968732089E-2,2.1243237234385891E-2,2.4151436709004912E-2,null,0.05,0.3,1.2306086170414508E-2,1.7305494968732089E-2,2.1243237234385891E-2,2.4151436709004912E-2]
[0.06,0.3,1.2306086170414508E-2,1.7305494968732089E-2,2.1243237234385891E-2,2.4151436709004912E-2,null,0.06,0.3,1.2306086170414508E-2,1.7305494968732089E-2,2.1243237234385891E-2,2.4151436709004912E-2]
[7.0000000000000007E-2,0.3,1.2306086170414508E-2,1.7305494968732089E-2,2.1243237234385891E-2,2.4151436709004912E-2,null,7.0000000000000007E-2,0.3,1.2306086170414508E-2,1.7305494968732089E-2,2.1243237234385891E-2,2.4151436709004912E-2]
[0.08,0.3,1.2306086170414508E-2,1.7305494968732089E-2,2.1243237234385891E-2,2.4151436709004912E-2,null,0.08,0.3,1.2306086170414508E-2,1.7305494968732089E-2,2.1243237234385891E-2,2.4151436709004912E-2]
[0.09,0.3,1.2306086170414508E-2,1.7305494968732089E-2,2.1243237234385891E-2,2.4151436709004912E-2,null,0.09,0.3,1.2306086170414508E-2,1.7305494968732089E-2,2.1243237234385891E-2,2.4151436709004912E-2]
[0.1,0.3,1.2306086170414508E-2,1.7305494968732089E-2,2.1243237234385891E-2,2.4151436709004912E-2,null,0.1,0.3,1.2306086170414508E-2,1.7305494968732089E-2,2.1243237234385891E-2,2.4151436709004912E-2]
[0.11,0.3,1.2306086170414508E-2,1.7305494968732089E-2,2.1243237234385891E-2,2.4151436709004912E-2,null,0.11,0.3,1.2306086170414508E-2,1.7305494968732089E-2,2.1243237234385891E-2,2.4151436709004912E-2]
[0.12,0.3,1.2306086170414508E-2,1.7305494968732089E-2,2.1243237234385891E-2,2.4151436709004912E-2,null,0.12,0.3,1.2306086170414508E-2,1.7305494968732089E-2,2.1243237234385891E-2,2.4151436709004912E-2]
[0.13,0.3,1.2306086170414508E-2,1.7305494968732089E-2,2.1243237234385891E-2,2.4151436709004912E-2,null,0.13,0.3,1.2306086170414508E-2,1.7305494968732089E-2,2.1243237234385891E-2,2.4151436709004912E-2]
[0.14000000000000001,0.3,1.2306086170414508E-2,1.7305494968732089E-2,2.1243237234385891E-2,2.4151436709004912E-2,null,0.14000000000000001,0.3,1.2306086170414508E-2,1.7305494968732089E-2,2.1243237234385891E-2,2.4151436709004912E-2]
[0.15,0.3,1.2306086170414508E-2,1.7305494968732089E-2,2.1243237234385891E-2,2.4151436709004912E-2,null,0.15,0.3,1.2306086170414508E-2,1.7305494968732089E-2,2.1243237234385891E-2,2.4151436709004912E-2]
[0.16,0.3,1.2306086170414508E-2,1.7305494968732089E-2,2.1243237234385891E-2,2.4151436709004912E-2,null,0.16,0.3,1.2306086170414508E-2,1.7305494968732089E-2,2.1243237234385891E-2,2.4151436709004912E-2]
[0.17,0.3,1.2306086170414508E-2,1.7305494968732089E-2,2.1243237234385891E-2,2.4151436709004912E-2,null,0.17,0.3,1.2306086170414508E-2,1.7305494968732089E-2,2.1243237234385891E-2,2.4151436709004912E-2]
[0.18,0.3,1.2306086170414508E-2,1.7305494968732089E-2,2.1243237234385891E-2,2.4151436709004912E-2,null,0.18,0.3,1.2306086170414508E-2,1.7305494968732089E-2,2.1243237234385891E-2,2.4151436709004912E-2]
[0.19,0.3,1.2306086170414508E-2,1.7305494968732089E-2,2.1243237234385891E-2,2.4151436709004912E-2,null,0.19,0.3,1.2306086170414508E-2,1.7305494968732089E-2,2.1243237234385891E-2,2.4151436709004912E-2]
[0.2,0.3,1.2306086170414508E-2,1.7305494968732089E-2,2.1243237234385891E-2,2.4151436709004912E-2,null,0.2,0.3,1.2306086170414508E-2,1.7305494968732089E-2,2.1243237234385891E-2,2.4151436709004912E-2]
[0.21,0.3,1.2306086170414508E-2,1.7305494968732089E-2,2.1243237234385891E-2,2.4151436709004912E-2,null,0.21,0.3,1.2306086170414508E-2,1.7305494968732089E-2,2.1243237234385891E-2,2.4151436709004912E-2]
[0.22,0.3,1.2306086170414508E-2,1.7305494968732089E-2,2.1243237234385891E-2,2.4151436709004912E-2,null,0.22,0.3,1.2306086170414508E-2,1.7305494968732089E-2,2.1243237234385891E-2,2.4151436709004912E-2]
[0.23,0.3,1.2306086170414508E-2,1.7305494968732089E-2,2.1243237234385891E-2,2.4151436709004912E-2,null,0.23,0.3,1.2306086170414508E-2,1.7305494968732089E-2,2.1243237234385891E-2,2.4151436709004912E-2]
[0.24,0.3,1.2306086170414508E-2,1.7305494968732089E-2,2.1243237234385891E-2,2.4151436709004912E-2,null,0.24,0.3,1.2306086170414508E-2,1.7305494968732089E-2,2.1243237234385891E-2,2.4151436709004912E-2]
[0.25,0.3,1.2306086170414508E-2,1.7305494968732089E-2,2.1243237234385891E-2,2.4151436709004912E-2,null,0.25,0.3,1.2306086170414508E-2,1.7305494968732089E-2,2.1243237234385891E-2,2.4151436709004912E-2]
[0.26,0.3,1.2306086170414508E-2,1.7305494968732089E-2,2.1243237234385891E-2,2.4151436709004912E-2,null,0.26,0.3,1.2306086170414508E-2,1.7305494968732089E-2,2.1243237234385891E-2,2.4151436709004912E-2]
[0.27,0.3,1.2306086170414508E-2,1.7305494968732089E-2,2.1243237234385891E-2,2.4151436709004912E-2,null,0.27,0.3,1.2306086170414508E-2,1.7305494968732089E-2,2.1243237234385891E-2,2.4151436709004912E-2]
[0.28000000000000003,0.3,1.2306086170414508E-2,1.7305494968732089E-2,2.1243237234385891E-2,2.4151436709004912E-2,null,0.28000000000000003,0.3,1.2306086170414508E-2,1.7305494968732089E-2,2.1243237234385891E-2,2.4151436709004912E-2]
[0.28999999999999998,0.3,1.2306086170414508E-2,1.7305494968732089E-2,2.1243237234385891E-2,2.4151436709004912E-2,null,0.28999999999999998,0.3,1.2306086170414508E-2,1.7305494968732089E-2,2.1243237234385891E-2,2.4151436709004912E-2]
[0.3,0.3,1.2306086170414508E-2,1.7305494968732089E-2,2.1243237234385891E-2,2.4151436709004912E-2,null,0.3,0.3,1.2306086170414508E-2,1.7305494968732089E-2,2.1243237234385891E-2,2.4151436709004912E-2]
[0.31,0.3,1.2306086170414508E-2,1.7305494968732089E-2,2.1243237234385891E-2,2.4151436709004912E-2,null,0.31,0.3,1.2306086170414508E-2,1.7305494968732089E-2,2.1243237234385891E-2,2.4151436709004912E-2]
[0.32,0.3,1.2306086170414508E-2,1.7305494968732089E-2,2.1243237234385891E-2,2.4151436709004912E-2,null,0.32,0.3,1.2306086170414508E-2,1.7305494968732089E-2,2.1243237234385891E-2,2.4151436709004912E-2]
[0.33,0.3,1.2306086170414508E-2,1.7305494968732089E-2,2.1243237234385891E-2,2.4151436709004912E-2,null,0.33,0.3,1.2306086170414508E-2,1.7305494968732089E-2,2.1243237234385891E-2,2.4151436709004912E-2]
[0.34,0.3,1.2306086170414508E-2,1.7305494968732089E-2,2.1243237234385891E-2,2.4151436709004912E-2,null,0.34,0.3,1.2306086170414508E-2,1.7305494968732089E-2,2.1243237234385891E-2,2.4151436709004912E-2]
[0.35,0.3,1.2306086170414508E-2,1.7305494968732089E-2,2.1243237234385891E-2,2.4151436709004912E-2,null,0.35,0.3,1.2306086170414508E-2,1.7305494968732089E-2,2.1243237234385891E-2,2.4151436709004912E-2]
[0.36,0.3,1.2306086170414508E-2,1.7305494968732089E-2,2.1243237234385891E-2,2.4151436709004912E-2,null,0.36,0.3,1.2306086170414508E-2,1.7305494968732089E-2,2.1243237234385891E-2,2.4151436709004912E-2]
[0.37,0.3,1.2306086170414508E-2,1.7305494968732089E-2,2.1243237234385891E-2,2.4151436709004912E-2,null,0.37,0.3,1.2306086170414508E-2,1.7305494968732089E-2,2.1243237234385891E-2,2.4151436709004912E-2]
{"$rows_left_out":54}
{"sheet":"Adm","index":1,"n_rows":18,"n_cols":34,"rows_kept":18,"cut":false,"hidden":true,"merged":[[0,11,0,13],[0,20,0,22],[0,14,0,16],[1,25,1,26],[0,4,0,5]]}
["Destino Inicio","ESQUEMA TASA","APOYO INFONAVIT","PLAZO","PERFIL DE RIESGO",null,"Valor mínimo de vivienda","Valor máximo de vivienda","Ingresos mínimos","TASAS","PAGOS POR MIL"," pago por mil CRECIENTES",null,null,"INCREMENTOS ANUALES",null,null,"AFOROS","COMISION APERTURA","Número de Intervinientes","SEGUROS",null,null,"RELACION INGRESO PAGO","AVALUO",null,null,null,"IVA","COMISION POR ADMON","SCV ","Tipo de Ingresos ","Tipo de vivienda","Costo estudio socioeconómico"]
[{"$f":"A3","v":"Adquisición"},{"$f":"Captura!G16","v":0},null,{"$f":"Captura!G18","v":0},{"$f":"Captura!K16","v":0},null,250000,3900000,6500,{"$f":"VLOOKUP(E2,E3:F7,2,0)","v":{"$error":"#N/A"}},{"$f":"IF(B2=B3,K4,IF(B2=B4,L2,0))","v":0},{"$f":"VLOOKUP(J2,L4:N5,MATCH(D2,L3:N3,0))","v":{"$error":"#N/A"}},null,null,{"$f":"IF(B2=B4,VLOOKUP(J2,O4:Q5,MATCH(D2,O3:Q3,0)),0)","v":0},null,null,{"$f":"Captura!AF3/Captura!Y1","v":{"$error":"#DIV/0!"}},0.01,{"$f":"Captura!G20","v":1},"¿Con el Banco?","VIDA","DAÑOS",{"$f":"0.35","v":0.35},{"$f":"_xlfn.XLOOKUP(Captura!G38,AA4:AA18,AB4:AB18,0,1,1)","v":2000},"Valor vivienda",null,"Precio",0.16,250,{"$f":"IF(B2=B3,Tablas!B1,IF(B2=B4,Tablas!I1,0))","v":0},null,2,1964]
["Adquisición","Congelados","NO",null,"Perfil 1",0.13500000000000001,null,null,null,0.125,"Congelados","TASA",20,25,"TASA",20,25,null,null,null,{"$f":"Captura!G22","v":"SI"},{"$f":"IF(U3=\"no\",0,IFERROR(VLOOKUP(Captura!G20,V8:W11,2,0),0))","v":6.1799999999999995E-4},{"$f":"IF(U4=\"no\",0,0.00037)","v":3.6999999999999999E-4},null,null,"Desde","Hasta",null,null,null,null,"Asalariado","Usada"]
["Apoyo Infonavit","Crecientes","SI",null,"Perfil 2",0.13500000000000001,null,null,null,0.13500000000000001,{"$f":"PMT(J2/12,D2*12,-1000)","v":{"$error":"#N/A"}},0.125,10.72,10.69,0.125,1.2E-2,5.0000000000000001E-3,null,null,null,{"$f":"Captura!G24","v":"SI"},null,null,null,null,0,500000,2000,null,null,null,"No Asalariado","Nueva"]
["Cofinavit",null,null,null,"Perfil 3",0.125,null,null,null,null,null,0.13500000000000001,11.63,11.61,0.13500000000000001,8.8000000000000005E-3,2.7000000000000001E-3,null,null,null,null,null,null,null,null,500001,1000000,3000,null,null,null,null,"Nueva Desarrollo Certificado"]
["Fovissste",null,"SALARIO MÍNIMO",null,"Perfil 4",0.125,null,null,null,null,null,null,null,null,null,null,null,null,null,null,"Lista de referencia",null,null,null,null,1000001,1500000,4500]
["Otros",null,88.36,null,"Perfil 5",0.125,null,null,null,null,null,null,null,null,null,null,null,null,null,null,"SI",null,null,null,null,1500001,2000000,6000]
[null,null,null,null,null,null,null,null,null,null,null,null,null,null,null,null,null,null,null,null,"NO",1,6.1799999999999995E-4,null,null,2000001,2500000,7000]
[null,null,{"$f":"C7*30.4","v":2686.1439999999998},null,null,null,null,null,null,null,null,null,null,null,null,null,null,null,null,null,null,2,9.8970000000000004E-4,null,null,2500001,3000000,9000]
[null,null,"25 SMMDF",null,null,null,null,null,null,null,null,null,null,null,null,null,null,null,null,null,null,3,1.2332000000000001E-3,null,null,3000001,3500000,10000]
[null,null,{"$f":"25*C9","v":67153.599999999991},null,null,null,null,null,null,null,null,null,null,null,null,null,null,null,null,null,null,4,1.5548000000000001E-3,null,null,3500001,4000000,11000]
[null,null,null,null,null,null,null,null,null,null,null,null,null,null,null,null,null,null,null,null,null,null,null,null,null,4000001,4500000,13500]
[null,null,"MONTO MAX VIV INFON",null,null,null,null,null,null,null,null,null,null,null,null,null,null,null,null,null,null,null,null,null,null,4500001,5500000,14000]
[null,null,0,null,null,null,null,null,null,null,null,null,null,null,null,null,null,null,null,null,null,null,null,null,null,5500001,6000000,17000]
[null,null,null,null,null,null,null,null,null,null,null,null,null,null,null,null,null,null,null,null,null,null,null,null,null,6000001,6500000,19000]
[null,null,null,null,null,null,null,null,null,null,null,null,null,null,null,null,null,null,null,null,null,null,null,null,null,6500001,8000000,20000]
[null,null,null,null,null,null,null,null,null,null,null,null,null,null,null,null,null,null,null,null,null,null,null,null,null,8000001,10000000,22000]
[null,null,null,null,null,null,null,null,null,null,null,null,null,null,null,null,null,null,null,null,null,null,null,null,null,10000001,999999999999,24000]

{"sheet":"Captura","index":2,"n_rows":387,"n_cols":36,"rows_kept":387,"cut":false,"hidden":false,"merged":[[373,2,373,13],[379,2,379,13],[380,2,380,13],[381,2,381,13],[382,2,382,13],[374,2,374,13],[375,2,375,13],[376,2,376,13],[377,2,377,13],[378,2,378,13],[393,2,393,11],[383,2,383,13],[388,2,388,11],[389,2,389,11],[390,2,390,11],[391,2,391,11],[392,2,392,11],[384,2,384,13],[385,2,385,13],[33,2,33,13],[62,2,62,13],[31,2,31,13],[1,5,1,10],[8,4,8,8],[6,12,6,13],[6,4,6,8],[2,12,2,13],[8,10,8,11],[47,10,47,11]]}
[null,null,null,null,null,null,null,null,null,null,null,null,null,null,null,null,null,null,{"$f":"IF(G16=\"\",\"Indica esquema de pagos\",IF(AND(G16<>\"\",G18=0),\"Captura el plazo\",IF(AND(G18<20,Adm!B2=Adm!B4),\"En pagos crecientes sólo plazos 20 y 25 años\",IF(AND(G16<>\"\",G20=0),\"Captura el número de intervinientes\",IF(AND(G16>\"\",G22=\"\"),\"Indica si contratará el seguro de Vida con el Santander\",IF(AND(G16<>\"\",G24=\"\"),\"Indica si contrarará el seguro de Daños con Santander\",IF(AND(G16<>\"\",G26=0),\"Captura el porcentaje de escrituración\",IF(AND(G16<>\"\",G28=0),\"Captura el valor de la vivienda deseada\",IF(AND(G28>0,G28<Adm!G2),\"El valor mínmo de vivienda es de $250,000\",IF(AND(G28>0,G28>Adm!H2),\"El valor máximo de vivienda es de $3,900,000\",IF(AND(G30>0,G30<Adm!I2),\"Los ingresos mínimos son $6,500\",IF(K16=\"\",\"Indica Perfil de riesgo\",\"\"))))))))))))","v":"Indica esquema de pagos"},null,null,null,null,"Valor vivienda",{"$f":"G28","v":0},null,null,null,null,"Ingresos"]
[null,null,null,null,null,"Simulador HIPOTECA INTEGRAL",null,null,null,null,null,null,null,null,null,null,null,null,null,null,null,null,null,"Enganche Obligatorio ",{"$f":"Y1*0.1","v":0},null,null,null,null,{"$f":"G30*Adm!X2","v":0}]
[null,null,null,null,null,null,null,null,null,null,null,null,{"$f":"TODAY()","v":"2026-03-31"},null,null,null,null,null,null,null,null,null,null,"Enganche Opcional",{"$f":"J28","v":0},null,null,null,null,{"$f":"IF(G30<0.001,0,IF(Adm!J2=Captura!Y12,AA12,IF(Adm!J2=Captura!Y13,AA13)))","v":0},"Crédito a financiar ",{"$f":"IF(AD3>=Y4,Y4,AD3)","v":0}]
[null,null,null,null,null,null,null,null,null,null,null,null,"dd mmm aaaa",{"$f":"TEXT(M3,M4)","v":"31 mar 2026"},null,null,null,null,null,null,null,null,null,"Crédito Banco necesario",{"$f":"Y1-Y2-Y3","v":0},null,null,null,null,null,"enganche faltante vivienda",{"$f":"Y1-Y2-AF3-Y3","v":0}]
[null,null,"1. Datos del solicitante",null,null,null,null,null,null,null,null,null,null,null,null,null,null,null,null,null,null,null,null,null,null,null,null,null,null,null,"Aforo para tablas SVC",{"$f":"ROUND(CEILING(AF3/Y1,0.05),2)","v":{"$error":"#DIV/0!"}}]
[null,null,null,null,null,null,null,null,null,null,null,null,null,null,null,null,null,null,null,null,null,null,null,"Aforo inicial estimado",{"$f":"ROUND(Y4/Y1,2)","v":{"$error":"#DIV/0!"}}]
[null,null,"Nombre del cliente"]
[]
[null,null,"Atendido por :",null,null,null,null,null,null,"Teléfono",null,null,null,null,null,null,null,null,null,null,null,null,null,null,"MATRIZ",null,null,null,null,{"$f":"Adm!AE2","v":0},"Importe SCV ",{"$f":"AF3*AD9","v":0}]
[]
[]
[null,null,"2. Condiciones financieras",null,null,null,null,null,null,null,null,null,null,null,null,null,null,null,null,null,null,null,null,null,{"$f":"Adm!J3","v":0.125},{"$f":"IF(Adm!B2=Adm!B3,PMT(Y12/12,Adm!D2*12,-1000),IF(Adm!B2=Adm!B4,VLOOKUP(Y12,Adm!L4:N5,MATCH(Adm!D2,Adm!L3:N3,0))))","v":false},{"$f":"AD2/Z12*1000","v":{"$error":"#DIV/0!"}},{"$f":"AA12/Y1","v":{"$error":"#DIV/0!"}}]
[null,null,null,null,null,null,null,null,null,null,null,null,null,null,null,null,null,null,null,null,null,null,null,null,{"$f":"Adm!J4","v":0.13500000000000001},{"$f":"IF(Adm!B2=Adm!B3,PMT(Y13/12,Adm!D2*12,-1000),IF(Adm!B2=Adm!B4,VLOOKUP(Y13,Adm!L4:N5,MATCH(Adm!D2,Adm!L3:N3,0))))","v":false},{"$f":"AD2/Z13*1000","v":{"$error":"#DIV/0!"}},{"$f":"AA13/Y1","v":{"$error":"#DIV/0!"}}]
[null,null,"Destino",null,null,null,"Adquisición",null,null,null,null,null,null,null,null,null,null,null,null,null,null,null,null,null,null,null,null,{"$f":"IF(AB12<=80%,AB12,AB13)","v":{"$error":"#DIV/0!"}}]
[]
[null,null,"Selecciona el esquema de Pagos",null,null,null,null,null,"Indica el perfil de riesgo estimado"]
[]
[null,null,"Plazo en años"]
[]
[null,null,"Número de Intervinientes",null,null,null,1]
[]
[null,null,"¿Contratarás el seguro de Vida con Santander?",null,null,null,"SI"]
[]
[null,null,"¿Contratarás el seguro de Daños con Santander?",null,null,null,"SI"]
[]
[null,null,"Porcentaje de escrituración"]
[]
[null,null,"Valor de la vivienda ",null,null,null,null,null,"Captura enganche opcional"]
[]
[null,null,"Captura tus ingresos  ",null,null,null,null,{"$f":"IF(Adm!T2>=2,\" Para créditos con más de 1 interviniente deberás capturar la suma de todos los ingresos\",\"\")","v":""}]
[]
[null,null,{"$f":"S1","v":"Indica esquema de pagos"}]
[null,null,"3. Oferta"]
[null,null,"Te mostramos la oferta a la que podrías acceder de acuerdo al aforo y plazo seleccionado. La tasa y el aforo final estarán en función de la Evaluación de Crédito."]
[]
[null,null,null,"DETALLE FINANCIAMIENTO",null,null,null,null,null,"GASTOS INICIALES"]
[]
[null,null,null,"Valor del inmueble",null,null,{"$f":"G28","v":0},null,null,"Contratación crédito",null,null,{"$f":"IF(C32<>\"\",0,AF3*Adm!S2)","v":0}]
[]
[null,null,null,null,null,"Enganche Obligatorio del esquema",{"$f":"IF(C32<>\"\",0,Y2)","v":0},null,null,"Gastos de preoriginación avalúo hipotecario",null,null,{"$f":"IF(C32<>\"\",0,Adm!Y2)","v":0}]
{"$rows_left_out":348}
{"sheet":"CAT","index":3,"n_rows":329,"n_cols":19,"rows_kept":329,"cut":false,"hidden":true,"merged":[]}
[]
[]
[]
[]
["CAT"]
[null,null,null,null,null,null,null,null,"Fecha ",{"$f":"TODAY()","v":"2026-03-31"}]
[null,"Nombre del Solicitante",null,{"$f":"Captura!E7","v":0},null,null,null,null,"Valor de la vivienda",{"$f":"Captura!G28","v":0}]
[null,"Atendido por",null,{"$f":"Captura!E9","v":0},null,null,null,null,"Suma asegurable",{"$f":"Captura!G28*0.7","v":0}]
[null,"Teléfono",null,{"$f":"Captura!K9","v":0},null,null,null,null,"Crédito total inicial",{"$f":"Captura!AF3","v":0}]
[null,null,null,null,null,null,null,null,"Tasa de interés",{"$f":"Adm!J2","v":{"$error":"#N/A"}}]
[null,"Tipo de tasa",{"$f":"IF(Adm!B2=1,Adm!B3,Adm!B4)","v":"Crecientes"},null,null,null,null,null,"Pago por mil inicial",{"$f":"Adm!K2","v":0}]
[null,"Gastos iniciales",null,null,null,null,null,null,"Plazo en años",{"$f":"Adm!D2","v":0}]
[null,null,null,null,null,null,null,null,"Número de Asegurados",{"$f":"Captura!G20","v":1}]
[null,"Avalúo",null,{"$f":"Adm!Y2","v":2000},null,null,null,null,"Ajuste anual",{"$f":"Adm!O2","v":0}]
[null,"Estudio",null,{"$f":"Captura!M44/1.16","v":0}]
[null,"Prima SCV (Seguro Crédito a la Vivienda)",null,{"$f":"Captura!M46","v":0}]
[null,"Comisión de apertura",null,{"$f":"J9*Adm!S2","v":0}]
[null,null,"TOTAL",{"$f":"SUM(D13:D17)","v":2000}]
[null,"CAT  ",{"$f":"S21","v":{"$error":"#NUM!"}},"Sin IVA",null,null,{"$f":"Captura!I371","v":0},{"$f":"Captura!J371","v":0},{"$f":"SUM(I25:I324)","v":0},null,null,null,null,null,null,null,null,null,{"$f":"SUM(S25:S324)","v":0}]
[null,null,null,null,null,null,{"$f":"G25*(J12*12)","v":0},{"$f":"H25*(J12*12)","v":0}]
[null,{"$f":"SUM(B25:B324)","v":0},{"$f":"SUM(C25:C324)","v":0},0,0,0,{"$f":"G19-G20","v":0},{"$f":"H19-H20","v":0},{"$f":"SUM(I25:I324)+G21+H21","v":0},null,null,null,null,null,null,null,null,null,{"$f":"(1+IRR(S24:S324,0.01))^12-1","v":{"$error":"#NUM!"}}]
["Periodo","Intereses","Amortización","Pago crédito",{"$f":"IF(Adm!A2=2,\"Aportaciones Infonavit\",\"\")","v":""},"Seguro vida","Seguro daños","Comisión por Administración","Pago total","Saldo al final del periodo",null,null,null,"IVA",null,null,null,null,"flujos"]
[null,null,null,null,null,null,null,null,null,null,null,null,null,null,"Mes","Creci.pago"]
[0,null,null,null,null,null,null,null,null,{"$f":"J9","v":0},null,null,null,null,12,"P. Programados",null,null,{"$f":"-Captura!AF3+D18","v":2000}]
[{"$f":"IF(J24<0.01,0,1)","v":0},{"$f":"IF(J24<0.001,0,J24*$J$10/12)","v":0},{"$f":"D25-B25","v":0},{"$f":"IF(Adm!B2=1,PMT(#REF!/12,#REF!*12,-J9),J9*J11/1000)","v":0},null,{"$f":"IF(J24<0.01,0,J24*Adm!$V$3)","v":0},{"$f":"IF(J24<0.01,0,($J$8*Adm!$W$3/1.16))","v":0},{"$f":"IF(J24<0.01,0,Adm!$AD$2)","v":0},{"$f":"IF(J24<0.01,0,(D25+F25+G25+H25))","v":0},{"$f":"IF(J24<0.01,0,(J24-C25-E25))","v":0},null,{"$f":"IF(J24<0.01,0,1)","v":0},null,null,{"$f":"IF(O24=12,1,O24+1)","v":1},null,null,null,{"$f":"I25","v":0}]
[{"$f":"IF(J25<0.01,0,A25+1)","v":0},0,0,{"$f":"IF(J25<0.001,0,MIN(J25+B26,D25*(1+P26)))","v":0},null,{"$f":"IF(J25<0.01,0,J25*Adm!$V$3)","v":0},{"$f":"IF(J25<0.01,0,$J$8*Adm!$W$3/1.16)","v":0},{"$f":"IF(J25<0.01,0,Adm!$AD$2)","v":0},{"$f":"IF(J25<0.01,0,(D26+F26+G26+H26))","v":0},{"$f":"IF(J25<0.01,0,(J25-C26-E26))","v":0},null,{"$f":"IF(J25<0.01,0,2)","v":0},null,null,{"$f":"IF(O25=12,1,O25+1)","v":2},{"$f":"IF(O26=1,$J$14,0)","v":0},null,null,{"$f":"I26","v":0}]
[0,0,0,0,null,{"$f":"IF(J26<0.01,0,J26*Adm!$V$3)","v":0},{"$f":"IF(J26<0.01,0,$J$8*Adm!$W$3/1.16)","v":0},{"$f":"IF(J26<0.01,0,Adm!$AD$2)","v":0},{"$f":"IF(J26<0.01,0,(D27+F27+G27+H27))","v":0},0,null,{"$f":"IF(J26<0.01,0,1)","v":0},null,null,3,{"$f":"IF(O27=1,$J$14,0)","v":0},null,null,0]
[0,0,0,0,null,{"$f":"IF(J27<0.01,0,J27*Adm!$V$3)","v":0},{"$f":"IF(J27<0.01,0,$J$8*Adm!$W$3/1.16)","v":0},{"$f":"IF(J27<0.01,0,Adm!$AD$2)","v":0},0,0,null,{"$f":"IF(J27<0.01,0,2)","v":0},null,null,4,0,null,null,0]
[0,0,0,0,null,{"$f":"IF(J28<0.01,0,J28*Adm!$V$3)","v":0},{"$f":"IF(J28<0.01,0,$J$8*Adm!$W$3/1.16)","v":0},{"$f":"IF(J28<0.01,0,Adm!$AD$2)","v":0},0,0,null,{"$f":"IF(J28<0.01,0,1)","v":0},null,null,5,0,null,null,0]
[0,0,0,0,null,{"$f":"IF(J29<0.01,0,J29*Adm!$V$3)","v":0},{"$f":"IF(J29<0.01,0,$J$8*Adm!$W$3/1.16)","v":0},{"$f":"IF(J29<0.01,0,Adm!$AD$2)","v":0},0,0,null,{"$f":"IF(J29<0.01,0,2)","v":0},null,null,6,0,null,null,0]
[0,0,0,0,null,{"$f":"IF(J30<0.01,0,J30*Adm!$V$3)","v":0},{"$f":"IF(J30<0.01,0,$J$8*Adm!$W$3/1.16)","v":0},{"$f":"IF(J30<0.01,0,Adm!$AD$2)","v":0},0,0,null,{"$f":"IF(J30<0.01,0,1)","v":0},null,null,7,0,null,null,0]
[0,0,0,0,null,{"$f":"IF(J31<0.01,0,J31*Adm!$V$3)","v":0},{"$f":"IF(J31<0.01,0,$J$8*Adm!$W$3/1.16)","v":0},{"$f":"IF(J31<0.01,0,Adm!$AD$2)","v":0},0,0,null,{"$f":"IF(J31<0.01,0,2)","v":0},null,null,8,0,null,null,0]
[0,0,0,0,null,{"$f":"IF(J32<0.01,0,J32*Adm!$V$3)","v":0},{"$f":"IF(J32<0.01,0,$J$8*Adm!$W$3/1.16)","v":0},{"$f":"IF(J32<0.01,0,Adm!$AD$2)","v":0},0,0,null,{"$f":"IF(J32<0.01,0,1)","v":0},null,null,9,0,null,null,0]
[0,0,0,0,null,{"$f":"IF(J33<0.01,0,J33*Adm!$V$3)","v":0},{"$f":"IF(J33<0.01,0,$J$8*Adm!$W$3/1.16)","v":0},{"$f":"IF(J33<0.01,0,Adm!$AD$2)","v":0},0,0,null,{"$f":"IF(J33<0.01,0,2)","v":0},null,null,10,0,null,null,0]
[0,0,0,0,null,{"$f":"IF(J34<0.01,0,J34*Adm!$V$3)","v":0},{"$f":"IF(J34<0.01,0,$J$8*Adm!$W$3/1.16)","v":0},{"$f":"IF(J34<0.01,0,Adm!$AD$2)","v":0},0,0,null,{"$f":"IF(J34<0.01,0,1)","v":0},null,null,11,0,null,null,0]
[0,0,0,0,null,{"$f":"IF(J35<0.01,0,J35*Adm!$V$3)","v":0},{"$f":"IF(J35<0.01,0,$J$8*Adm!$W$3/1.16)","v":0},{"$f":"IF(J35<0.01,0,Adm!$AD$2)","v":0},0,0,null,{"$f":"IF(J35<0.01,0,2)","v":0},null,null,12,0,null,null,0]
[0,0,0,0,null,{"$f":"IF(J36<0.01,0,J36*Adm!$V$3)","v":0},{"$f":"IF(J36<0.01,0,$J$8*Adm!$W$3/1.16)","v":0},{"$f":"IF(J36<0.01,0,Adm!$AD$2)","v":0},0,0,null,{"$f":"IF(J36<0.01,0,1)","v":0},null,null,1,0,null,null,0]
[0,0,0,0,null,{"$f":"IF(J37<0.01,0,J37*Adm!$V$3)","v":0},{"$f":"IF(J37<0.01,0,$J$8*Adm!$W$3/1.16)","v":0},{"$f":"IF(J37<0.01,0,Adm!$AD$2)","v":0},0,0,null,{"$f":"IF(J37<0.01,0,2)","v":0},null,null,2,0,null,null,0]
[0,0,0,0,null,{"$f":"IF(J38<0.01,0,J38*Adm!$V$3)","v":0},{"$f":"IF(J38<0.01,0,$J$8*Adm!$W$3/1.16)","v":0},{"$f":"IF(J38<0.01,0,Adm!$AD$2)","v":0},0,0,null,{"$f":"IF(J38<0.01,0,1)","v":0},null,null,3,0,null,null,0]
[0,0,0,0,null,{"$f":"IF(J39<0.01,0,J39*Adm!$V$3)","v":0},{"$f":"IF(J39<0.01,0,$J$8*Adm!$W$3/1.16)","v":0},{"$f":"IF(J39<0.01,0,Adm!$AD$2)","v":0},0,0,null,{"$f":"IF(J39<0.01,0,2)","v":0},null,null,4,0,null,null,0]
{"$rows_left_out":289}