{"text_format":"1","workbook":"xlsx","n_sheets":5,"sheets":["Simulador","Tabla de amortizacion","Carat_cont","RECAS","Pol"],"not_rendered":{"charts":0,"images":5,"macros":1,"external_links":0,"defined_names":5,"comments":3,"pivot_tables":0},"unopened":[],"bounds":{"document_bytes":16777216,"sheet_cells":100000,"rows_first":2000,"rows_last":500,"rows_between":2000,"halvings":0,"cell_chars":16384,"cell_head_chars":4096},"cells_cut":0,"cells_raw":0,"read":"whole","date_system":"1900"}

{"sheet":"Simulador","index":0,"n_rows":114,"n_cols":41,"rows_kept":114,"cut":false,"hidden":false,"merged":[[2,2,2,15],[4,2,4,15],[11,2,11,5],[17,8,17,11],[24,10,24,13],[14,2,14,5],[5,2,5,15],[11,10,11,13],[57,2,57,13],[25,6,25,7],[62,24,65,24],[62,23,65,23],[3,18,3,26],[16,18,16,26],[27,6,27,7],[28,6,28,7]]}
[null,null,null,null,null,null,null,null,null,null,null,null,null,null,null,null,null,".",null,null,null,null,null,null,null,null,null,null,null,null,null,null,null,null,null,null,null,null,null,null,"-"]
[null,null,null,null,null,null,null,null,null,null,null,null,null,null,null,null,null,null,"CALCULO DE LA PORCION A CON BASE EN EL SSV REMANENTE",null,null,null,null,null,null,null,null,null,null,null,"CALCULO CRÉDITO COFINAVIT"]
[null,null,null,null,null,null,null,null,null,null,null,null,null,null,null,null,null,null,null,null,null,null,null,null,null,null,null,null,null,null,null,null,null,null,{"$f":"IF(OR(U39=4,U39=5),\"SI\",\"\")","v":""}]
[null,null,null,null,null,null,null,null,null,null,null,null,null,null,null,null,null,null,"SSV INFONAVIT",null,null,null,null,null,null,null,null,null,null,null,"Valor del inmueble",{"$f":"O24","v":0},null,null,{"$f":"IF(OR(U39=4,U39=5),\"NO\",\"\")","v":""}]
[null,null,"FINANCIAMIENTO RESIDENCIAL SCOTIABANK ",null,null,null,null,null,null,null,null,null,null,null,null,null,null,null,"Uso de la SSV",null,null,"Proyección de Anualidades Garantizadas"]
[null,null,"7x5",null,null,null,null,null,null,null,null,null,null,null,null,null,null,null,"SSV Total",null,null,"Tasa SSV Proyectar",0.05,null,null,null,null,null,null,null,"Gastos relacionados",{"$f":"O34","v":0}]
[null,null,null,null,null,null,null,null,null,null,null,null,null,null,null,null,null,null,"SSV al frente",null,null,"Año",1,2,3,4,5]
[null,null,{"$f":"TODAY()","v":"2024-03-22"},null,null,null,null,null,null,null,null,null,null,null,null,null,null,null,"SSV Remanente",{"$f":"D37+D44","v":{"$error":"#VALUE!"}},null,"Saldo Inicial",{"$f":"$T$8","v":{"$error":"#VALUE!"}},{"$f":"W12","v":{"$error":"#VALUE!"}},{"$f":"X12","v":{"$error":"#VALUE!"}},{"$f":"Y12","v":{"$error":"#VALUE!"}},{"$f":"Z12","v":{"$error":"#VALUE!"}},null,null,null,"Valor del inmueble al 75%",{"$f":"AF4*AF17","v":0}]
[null,null,null,null,null,null,null,null,null,null,null,null,null,null,null,null,null,null,null,null,null,"Tasa Efectiva",{"$f":"W6","v":0.05},{"$f":"W9","v":0.05},{"$f":"X9","v":0.05},{"$f":"Y9","v":0.05},{"$f":"Z9","v":0.05}]
[null,null,null,null,null,null,null,null,null,null,null,null,null,null,null,null,null,null,null,null,null,"Intereses",{"$f":"W8*$W$6","v":{"$error":"#VALUE!"}},{"$f":"X8*$W$6","v":{"$error":"#VALUE!"}},{"$f":"Y8*$W$6","v":{"$error":"#VALUE!"}},{"$f":"Z8*$W$6","v":{"$error":"#VALUE!"}},{"$f":"AA8*$W$6","v":{"$error":"#VALUE!"}}]
[null,null,"Nombre del Ejecutivo Especializado",null,null,null,"Sucursal",null,null,null,"Nombre del Cliente",null,null,null,null,null,null,null,null,null,null,"Anualidad Garantizada",{"$f":"(W8+W10)/5","v":{"$error":"#VALUE!"}},{"$f":"(X8+X10)/4","v":{"$error":"#VALUE!"}},{"$f":"(Y8+Y10)/3","v":{"$error":"#VALUE!"}},{"$f":"(Z8+Z10)/2","v":{"$error":"#VALUE!"}},{"$f":"(AA8+AA10)/1","v":{"$error":"#VALUE!"}},null,null,null,"Crédito Infonavit Neto",{"$f":"IFERROR((D38+D45),0)","v":0}]
[null,null,null,null,null,null,null,null,null,null,null,null,null,null,null,null,null,null,null,null,null,"Saldo Final",{"$f":"W8+W10-W11","v":{"$error":"#VALUE!"}},{"$f":"X8+X10-X11","v":{"$error":"#VALUE!"}},{"$f":"Y8+Y10-Y11","v":{"$error":"#VALUE!"}},{"$f":"Z8+Z10-Z11","v":{"$error":"#VALUE!"}},{"$f":"AA8+AA10-AA11","v":{"$error":"#VALUE!"}},null,null,null,"SSV al frente",{"$f":"D36+D43","v":0}]
[null,null,"Teléfonos",null,null,null,null,null,null,null,"Teléfonos",null,null,null,null,null,null,null,null,null,null,"Calculo del Valor Presente de las Anualidades Garantizadas",null,null,null,null,null,null,null,null,"Cred. Total Infonavit",{"$f":"+AF11+AF12","v":0}]
[null,null,null,null,null,null,null,null,null,null,null,null,null,null,null,null,null,null,null,null,null,"Factor de Descuento",{"$f":"1/(1+$T$20)^1","v":0.90702947845804982},{"$f":"1/(1+$T$20)^2","v":0.82270247479188197},{"$f":"1/(1+$T$20)^3","v":0.74621539663662761},{"$f":"1/(1+$T$20)^4","v":0.67683936202868722},{"$f":"1/(1+$T$20)^5","v":0.61391325354075932}]
[null,null,null,null,null,null,null,null,null,null,null,null,null,null,null,null,null,null,null,null,null,"Valor Presente de la Anualidad",{"$f":"W11*W14","v":{"$error":"#VALUE!"}},{"$f":"X11*X14","v":{"$error":"#VALUE!"}},{"$f":"Y11*Y14","v":{"$error":"#VALUE!"}},{"$f":"Z11*Z14","v":{"$error":"#VALUE!"}},{"$f":"AA11*AA14","v":{"$error":"#VALUE!"}}]
{"$rows_left_out":100}
{"sheet":"Tabla de amortizacion","index":1,"n_rows":256,"n_cols":56,"rows_kept":256,"cut":false,"hidden":false,"merged":[[2,0,2,27],[3,0,3,27],[0,0,0,27],[1,0,1,27],[4,11,4,13]]}
["Scotiabank Inverlat, S.A., Institución de Banca Múltiple, Grupo Financiero Scotiabank Inverlat",null,null,null,null,null,null,null,null,null,null,null,null,null,null,null,null,null,null,null,null,null,null,null,null,null,null,null,null,null,null,null,null,null,null,null,null,null,null,null,null,null,null,null,null,null,null,null,null,null,null,null,null,null,null,"-"]
["FINANCIAMIENTO RESIDENCIAL SCOTIABANK"]
["TABLA DE AMORTIZACION",null,null,null,null,null,null,null,null,null,null,null,null,null,null,null,null,null,null,null,null,null,null,null,null,null,null,null,null,null,null,2]
["7x5",null,null,null,null,null,null,null,null,null,null,null,null,null,null,null,null,null,null,null,null,null,null,null,null,null,null,null,null,null,null,{"$f":"IF(Simulador!U62=1,\"Disminución de plazo\",\"\")","v":""}]
["Observaciones",null,null,null,null,null,null,null,null,null,null,null,null,null,null,null,null,null,null,null,null,null,null,null,null,null,null,null,null,null,null,{"$f":"IF(Simulador!U62=1,\"Disminución de pago\",\"\")","v":""}]
["- En caso de que aplique la comisión por prepagos causa IVA y en la corrida ya lo incluye"]
["- El escenario de la tabla de amortización es considerando que siempre se paga el crédito de manera puntual .",null,null,null,null,null,null,null,null,null,null,null,null,null,null,null,null,null,null,null,null,null,null,null,null,null,null,null,null,"Comisión por apertura",null,null,{"$f":"IFERROR(Simulador!O32*1,0)","v":0}]
["- Esta cotización tiene carácter informativo, Scotiabank se reserva el derecho de cambiar cualquier condición sin previo aviso.",null,null,null,null,null,null,null,null,null,null,null,null,null,null,null,null,null,null,null,null,null,null,null,null,null,null,null,null,"Avalúo",null,null,{"$f":"IFERROR(Simulador!O31*1,0)","v":0},null,null,null,null,null,null,null,null,null,{"$f":"AQ12*12","v":0}]
["- Este documento NO implica que el crédito ha sido autorizado, ni establece obligación alguna para Scotiabank.",null,null,null,null,null,null,null,null,null,null,null,null,null,null,null,null,null,null,null,null,null,null,null,null,null,null,null,null,"Total",null,null,{"$f":"+AG8+AG7","v":0},null,{"$f":"AI13*12","v":0},null,null,null,null,null,null,null,{"$f":"((1+AQ12)^12)-1","v":0}]
["- CAT =.",{"$f":"AQ9","v":0},"\"Para fines informativos de comparación exclusivamente sin IVA\"",null,null,null,null,null,null,null,null,null,null,null,null,null,null,null,null,null,"El crédito se liquida",null,null,null,{"$f":"AG14","v":0},"Años",null,null,null,null,null,null,null,null,{"$f":"((1+AI13)^12)-1","v":0},null,null,null,null,null,null,null,"Corrida para CAT"]
[{"$f":"IF(Simulador!$U$62=1,\"\",\"- Apartir del mes número 61 y en caso de que el cliente no se reúna con el Banco para revisar y negociar la nueva Tasa de interés que rejirá el crédito, la Tasa de Interés aplicable\")","v":"- Apartir del mes número 61 y en caso de que el cliente no se reúna con el Banco para revisar y negociar la nueva Tasa de interés que rejirá el crédito, la Tasa de Interés aplicable"},null,null,null,null,null,null,null,null,null,null,null,null,null,null,null,null,null,null,null,"por pago puntual en:",null,null,null,{"$f":"AH14","v":0},"Meses",null,null,null,null,null,null,"Techo",null,"Corrida para CAT",null,null,null,null,null,null,null,"TIR"]
[{"$f":"IF(Simulador!$U$62=1,\"\",\"  será de T.I.I.E. más 4.5 puntos porcentuales, por lo que los valores que se muestran se ajustarán durante la vigencia del crédito en función de la Tasa de Interés variable señalada.\")","v":"  será de T.I.I.E. más 4.5 puntos porcentuales, por lo que los valores que se muestran se ajustarán durante la vigencia del crédito en función de la Tasa de Interés variable señalada."},null,null,null,null,null,null,null,null,null,null,null,null,null,null,null,null,null,null,null,null,null,null,null,null,null,null,null,null,null,null,null,0.15,null,"TIR",null,null,null,null,null,null,null,{"$f":"IFERROR(IRR(AQ13:AQ254,0),0)","v":0}]
[null,null,null,null,null,null,null,null,null,null,null,null,null,null,null,null,null,null,null,null,null,null,null,null,null,null,null,".",null,null,null,null,{"$f":"Simulador!D26+Simulador!U75","v":4.4999999999999998E-2},null,{"$f":"IFERROR(IRR(AI14:AI254,0),0)","v":0},null,null,null,null,null,null,null,{"$f":"AG9-B15","v":0}]
["Período","Saldo Inicial",null,"Erogación",null,"Interés",null,"Amortización",null,"Prepagos a capital",null,"Comisión por prepagos",null,"Aportación Bimestral (Apoyo Inf)",null,"Tasa aplicada",null,"Saldo Final",null,"Seguro de vida y desempleo",null,"Seguro de daños",null,null,"Pago Mensual",null,"Inc. Pago",null,"Modificación tasa TIIE","años","meses",{"$f":"SUM(AF15:AF254)","v":1},{"$f":"SUM(AG15:AG254)","v":0},{"$f":"SUM(AH15:AH254)","v":0},{"$f":"AG9-B15","v":0},"factor de pago Valora","Saldo Inicial","Erogación","Interés","Amortización","Saldo Final","Seguros","Pago Mensual","Tasa aplicada","Plazo","Fecha Corte/ Emisión Recibo 1","Dias",null,"Año actual","Mes actual","Día actual","Dia/corte","sumar"]
[1,{"$f":"IFERROR(IF(Simulador!O25=\"\",Simulador!I25,Simulador!O25),0)","v":0},null,{"$f":"IFERROR(B15/1000*VLOOKUP(Simulador!U62,Simulador!S63:W66,5,0),0)","v":0},null,{"$f":"IFERROR(IF(B15=0,0,P15/360*AU15*B15),0)","v":0},null,{"$f":"D15-F15","v":0},null,null,null,{"$f":"IF(Simulador!$T$41=1,0,J15*Simulador!$W$39*1.16)","v":0},null,null,null,{"$f":"IFERROR(IF(B15=0,0,Simulador!$V$67),0)","v":0},null,{"$f":"IFERROR(B15-H15-J15+L15-N15,0)","v":0},null,{"$f":"IFERROR(IF(Simulador!$U$30=1,0,IF($B15<=0,0,$B15*Simulador!$AA$43)),0)","v":0},null,{"$f":"IFERROR(IF(Simulador!$U$30=1,0,IF($B15<=0,0,IF(Simulador!$D$22>0,Simulador!$D$22,Simulador!$O$24)*Simulador!$AA$44)),0)","v":0},null,null,{"$f":"IF(B15<=0,0,D15+J15+T15+V15)","v":0},null,null,null,null,0,{"$f":"IF(B15=0,0,1)","v":0},{"$f":"IF(R15<=0.01,IF(R14>0.01,A15,0),0)","v":1},{"$f":"IF(AF15>0,AD15,0)","v":0},{"$f":"IF(AF15>0,AE15,0)","v":0},{"$f":"Y15","v":0},{"$f":"IFERROR((AL15/AK15),0)","v":0},{"$f":"B15","v":0},{"$f":"D15","v":0},{"$f":"IFERROR(IF(AK15=0,0,AR15/360*AU15*AK15),0)","v":0},{"$f":"+AL15-AM15","v":0},{"$f":"+AK15-AN15","v":0},{"$f":"IFERROR(IF(Simulador!$U$30=1,0,IF($AK15<=0,0,$AK15*Simulador!$AA$43)),0)+IFERROR(IF(Simulador!$U$30=1,0,IF($AK15<=0,0,IF(Simulador!$D$22>0,Simulador!$D$22,Simulador!$O$24)*Simulador!$AA$44)),0)","v":0},{"$f":"AL15+AP15","v":0},{"$f":"IFERROR(IF(AK15=0,0,Simulador!$V$67),0)","v":0},{"$f":"IF(Simulador!U62=1,60,IF(Simulador!U62=2,120,IF(Simulador!U62=3,180,240)))","v":240},{"$f":"IF(AK15=0,\"\",DATE(AW15,AX15+BA15,AZ15))","v":""},{"$f":"IFERROR(DAY(DATE(YEAR(AT15),MONTH(AT15)+1,0)),0)","v":0},1,{"$f":"IFERROR(YEAR(Simulador!C8),YEAR(Simulador!C8))","v":2024},{"$f":"IFERROR(MONTH(Simulador!C8),MONTH(Simulador!C8))","v":3},{"$f":"IFERROR(DAY(Simulador!C8),DAY(Simulador!C8))","v":22},{"$f":"IF(AND(DAY(TODAY())>=3,DAY(TODAY())<=16),3,17)","v":17},{"$f":"IF(AY15>AZ15,1,0)","v":1}]
{"$rows_left_out":242}
{"sheet":"Carat_cont","index":2,"n_rows":45,"n_cols":4,"rows_kept":45,"cut":false,"hidden":false,"merged":[[44,0,44,3],[38,0,38,3],[31,2,33,3],[27,0,27,3],[43,0,43,3],[35,0,35,3],[42,0,42,3],[41,0,41,3],[36,0,36,3],[0,0,0,3],[16,1,16,3],[17,1,17,3],[20,0,20,1],[19,2,19,3],[1,0,1,3],[18,0,18,3],[6,1,6,3],[8,0,8,3],[21,0,21,3],[39,0,39,3],[40,0,40,3],[37,0,37,3],[7,0,7,3],[34,0,34,3],[20,2,20,3],[19,0,19,1],[24,0,24,3],[22,0,22,3],[25,0,25,3],[23,0,23,3],[26,0,26,3]]}
[]
["Carátula de Crédito "]
[null,null,null,"Nombre del Acreditado y/o Coacreditado:"]
[null,null,null,{"$f":"IF(Simulador!M11=\"\",\"\",Simulador!M11)","v":""}]
[null,null,null,"Número de Crédito:"]
[]
["Nombre comercial del producto: ",{"$f":"INDEX(Simulador!AE33:AE38,Simulador!U39)&\" 7x5 \"&\" \"&A18","v":"CREDIRESIDENCIAL 7x5  20 años"}]
[]
["Tipo de Crédito: Crédito Hipotecario "]
["CAT","TASA DE INTERES","MONTO O LINEA DE","MONTO TOTAL A PAGAR O"]
["(Costo Anual Total)","ANUAL ORDINARIA","CRÉDITO","MINIMO A PAGAR"]
[{"$f":"Simulador!I41","v":0},{"$f":"VLOOKUP(Simulador!U62,Simulador!$S$63:$V$66,4,0)","v":0.1075},{"$f":"IFERROR(IF(Simulador!O25=\"\",Simulador!I25,Simulador!O25),0)","v":0},{"$f":"IFERROR(SUM('Tabla de amortizacion'!Y15:Y254),0)","v":0}]
["Sin IVA","Tasa Fija",null,"Moneda en"]
["Para fines",null,null,"Pesos"]
["informativos y de",{"$f":"IF(Simulador!$U$62=1,\"\",IF(Simulador!$D$26=0,0,MIN(Simulador!$D$26+Simulador!U75,'Tabla de amortizacion'!AG12)))","v":0},null,"Mexicanos "]
{"$rows_left_out":31}
{"sheet":"RECAS","index":3,"n_rows":10,"n_cols":8,"rows_kept":10,"cut":false,"hidden":false,"merged":[[0,1,0,4]]}
[{"$f":"Simulador!$U$39&\"-3-\"&IF(OR(Simulador!$D$43>0,Simulador!$D$45>0),2,IF(AND(Simulador!U39=6,Simulador!D39>0),2,1))","v":"1-3-1"},"RELACIÓN RECAS"]
["Clave","No.","Nombre","RECA","Fecha de expedición","Tipo Crédito","Esquema","Mancomunado"]
[{"$f":"F3&\"-\"&G3&\"-\"&H3","v":"5-3-1"},31,"Pago de Pasivos Hipoteca 7x5 con Apoyo Infonavit","0319-138-024406/15-00083-0124","2024-01-15",5,3,1]
["2-3-1",32,"Adquisición Con Apoyo Hipoteca 7 x 5","0319-138-038241/02-00084-0124","2024-01-15",2,3,1]
["1-3-1",33,"Adquisición Hipoteca 7 x 5","0319-138-020519/15-00085-0124","2024-01-15",1,3,1]
["3-3-2",34,"Cofinavit Conyugales Hipoteca 7 x 5","0319-138-020524/16-00086-0124","2024-01-15",3,3,2]
["3-3-1",35,"Cofinavit Hipoteca 7 x 5","0319-138-020525/16-00087-0124","2024-01-15",3,3,1]
["4-3-1",36,"Pago de Pasivo Hipoteca 7 x 5","0319-138-038243/02-00088-0124","2024-01-15",4,3,1]
["6-3-1",48,"Cofinavit CI+CB 7x5","0319-138-035433/06-00100-0124","2024-01-15",6,3,1]
["6-3-2",49,"Cofinavit CI+CB Cofinavit Conyugal 7x5","0319-138-035434/06-00101-0124","2024-01-15",6,3,2]

{"sheet":"Pol","index":4,"n_rows":68,"n_cols":23,"rows_kept":68,"cut":false,"hidden":true,"merged":[[6,18,6,22],[31,0,31,1],[38,0,40,0],[20,2,25,2],[20,3,20,6],[21,3,21,6],[22,3,22,6],[23,3,23,6],[26,3,27,6],[24,3,24,6],[25,3,25,6],[6,13,9,13],[6,14,10,14],[6,15,9,15],[6,16,10,16],[0,2,0,9],[1,2,1,9],[2,2,5,2],[6,7,10,7],[6,8,10,8],[6,9,10,9],[3,3,3,6],[3,7,5,7],[4,5,5,5],[3,8,5,8],[2,3,2,9],[3,9,5,9],[0,12,0,16],[1,12,1,16],[2,12,2,16],[4,13,4,14],[4,15,4,16],[3,13,3,16],[45,2,45,6],[46,2,46,6],[47,2,49,2],[47,3,47,4],[48,3,48,4],[47,5,48,6],[50,6,51,6],[51,3,52,3],[51,4,52,4],[51,5,53,5],[53,3,54,3],[53,4,54,4],[53,6,54,6],[63,11,65,11],[58,2,58,12],[59,2,62,2],[59,3,59,10],[59,11,59,12],[60,3,60,4],[61,3,61,4],[60,5,61,6],[60,7,61,8],[60,9,61,10],[60,11,60,12],[61,11,61,12],[63,12,65,12],[66,10,67,10],[66,11,67,11],[66,12,67,12],[64,3,65,3],[64,4,65,4],[64,6,65,6],[64,8,65,8],[66,3,67,3],[66,4,67,4],[66,5,67,5],[66,6,67,6],[66,8,67,8],[63,5,65,5],[63,7,67,7],[63,9,67,9],[63,10,64,10]]}
[null,null,"El Aforo estará alineado al producto que se desee adquirir vs Índice de Riesgo, acorde a lo siguiente:",null,null,null,null,null,null,null,null,null,"C) AFORO PARA CRÉDITOS QUE EXCEDAN EL MONTO A FINANCIAR POR POLÍTICA (APARTADO A.7):",null,null,null,null,null,"Plazo del crédito (años)",5,10,15,20]
[null,null,null,null,null,null,null,null,null,null,null,null,null,null,null,null,null,null,"Tasa de interés inicial fija (*)",7.2999999999999995E-2,7.7499999999999999E-2,7.8E-2,7.85E-2]
[null,null,"IR","AFORO",null,null,null,null,null,null,null,null,"Para créditos que superen el límite máximo establecido en el apartado A.7 de la presente política, el Aforo máximo está en función del importe del crédito, como se indica a continuación:",null,null,null,null,null,"Pago por mil inicial",20.23,8.3000000000000007,8.3000000000000007,8.3000000000000007]
[null,null,null,"Adquisición (1)",null,null,null,"Liquidez Vivienda Terrenos","Construcción / Renovación II, III y IV ","Renovación I",null,null,null,"Monto del crédito",null,null,null,null,"CAT",9.6462634102279177E-2,0.10555092664671206,0.11006679751714032,0.1126258651403893]
[null,null,null,"Empleados ","Empleados ","Independientes","Vivienda",null,null,null,null,null,null,"Mayor a $5 MDP Menor a $6.5 MDP",null,"Mayor a $ 6.5 MDP",null,null,"Pagos","Iguales","Iguales","Iguales","Iguales"]
[null,null,null,"con apoyo","sin apoyo",null,"Descanso",null,null,null,null,null,"IR / Subproducto","Adquisición","Liquidez/Construcción/ Credirenovación","Adquisición","Liquidez/Construcción/ Credirenovación",null,"Revisiones cada 5 años","No aplica","Si","Si","Si"]
[null,null,1,0.95,0.9,0.85,0.65,"Hasta el 50% de acuerdo al valor del avalúo de la garantía. ","Hasta el 70% del valor proyectado de la vivienda o el 100% del valor de construcción, el menor","Hasta el 70% de acuerdo al valor del avalúo de la garantía.",null,null,1,0.65,0.65,0.55000000000000004,0.5,null,"% saldo remanente"]
[null,null,2,0.95,0.9,0.85,0.65,null,null,null,null,null,2,null,null,null,null,null,"Periodo 1",-1.6370904631912709E-16,0.59538061608442694,0.78499668110631449,0.87340842146161934]
[null,null,3,0.95,0.85,0.8,0.5,null,null,null,null,null,3,null,null,null,null,null,"Periodo 2","NA",-4.3473846744745971E-16,0.49995107180906884,0.72360122387207726]
[null,null,4,0.8,0.8,0.75,0.5,null,null,null,null,null,4,null,null,null,null,null,"Periodo 3","NA","NA",-4.8385118134319785E-16,0.46084934642953529]
[null,null,5,0.8,0.7,0.5,0.5,null,null,null,null,null,5,0.5,null,0.5,null,null,"Periodo 4","NA","NA","NA",7.2759576141834256E-18]
[]
[]
[]
[]
{"$rows_left_out":53}