{"text_format":"1","workbook":"xlsx","n_sheets":4,"sheets":["Guía Rápida","Resumen","Amortización","Oferta Vinculante"],"not_rendered":{"charts":0,"images":1,"macros":1,"external_links":0,"defined_names":3,"comments":0,"pivot_tables":0},"unopened":[],"bounds":{"document_bytes":16777216,"sheet_cells":100000,"rows_first":2000,"rows_last":500,"rows_between":2000,"halvings":0,"cell_chars":16384,"cell_head_chars":4096},"cells_cut":0,"cells_raw":0,"read":"whole","date_system":"1900"}

{"sheet":"Guía Rápida","index":0,"n_rows":15,"n_cols":2,"rows_kept":15,"cut":false,"hidden":false,"merged":[[1,1,1,7],[2,1,2,7],[3,1,3,7],[4,1,4,7],[5,1,5,7],[6,1,6,7],[7,1,7,7],[8,1,8,7],[9,1,9,7],[10,1,10,7],[12,1,12,7],[13,1,13,7],[14,1,14,7],[15,1,15,7],[16,1,16,7],[17,1,17,7],[18,1,18,7],[19,1,19,7],[26,1,26,7],[27,1,27,7],[20,1,20,7],[21,1,21,7],[22,1,22,7],[23,1,23,7],[24,1,24,7],[25,1,25,7]]}
[]
[null,"Guía Rápida"]
[null,"A) Al abrir el simulador da click en \"Habilitar Contenido\" en caso de aparecer esta opción."]
[null,"B) Seleccionar el Perfil del Cliente \"Premier, No Premier\""]
[null,"C) Seleccionar el tipo de simulación \"Por Valor de la Vivienda, Por Monto del Crédito Y Valor de la Vivienda, Por Ingresos del Cliente\""]
[null,"D) Seleccionar Producto \"Adquisición, Exclusiva, Liquidez, Pago de Hipoteca\""]
[null,"E) Seleccionar Tipo de Financiamiento \"Tradicional, Cofinavit, Apoyo Infonavit, Respalda2, Alia2\""]
[null,"F) Introducir el valor de la vivienda"]
[null,"G) Seleccionar Plazo \"5,10,15,20 años\""]
[null,"H) Si es el caso introduce el importe del crédito o el ingreso mensual del cliente"]
[null,"I) Si es el caso, introduce el crédito Infonavit o FOVISSSTE y el saldo de la subcuenta."]
[null,"J) Seleccionar si es cliente Nómina HSBC o No"]
[null,"K) En caso de haber elegido un \"Adquisición, No Premier\" aparecerá un combo para elegir una tasa, seleccionar alguna. Con la tasa más baja solo accedemos al 65% de LTV, con la tasa más alta solo accedemos al 75% de LTV"]
[null,"L) En caso de elegir la tasa más alta (Nivel de riesgo alto) y solicitar un aforo superior al 75%, seleccionar \"SI\" en el combo \"LTV 90%\", con esto se cobrará la sobretasa"]
[null,"M) En caso de tener duda o creer que algo puede estar afectando la simulación selecciona \"Nueva Cotización\" y vuelve a empezar"]

{"sheet":"Resumen","index":1,"n_rows":268,"n_cols":63,"rows_kept":268,"cut":false,"hidden":false,"merged":[[25,8,27,9],[33,6,33,7],[40,2,40,7],[46,2,46,7],[39,2,39,7],[41,2,41,7],[42,2,42,7],[43,2,43,7],[37,2,37,7],[38,2,38,7],[30,5,30,7],[35,2,35,7],[36,2,36,7],[31,6,31,7],[32,6,32,7],[3,3,3,5],[26,6,26,7],[27,6,27,7],[28,6,28,7],[17,6,17,7],[19,6,19,7],[16,6,16,7],[15,5,15,7],[21,6,21,7],[25,6,25,7],[23,5,23,7]]}
[]
[]
[null,null,null,null,null,null,null,null,null,null,null,"Cliente HSBC","Tipo","Producto","Tipo Financiamiento","Plazo","Aguascalientes",{"$f":"IF($N$20=\"VERDADERO\",$N$28,0.3174)","v":0.31740000000000002},null,null,"Pago Fijo "]
[null,null,null,"CREDITO HIPOTECARIO",null,null,null,null,null,null,null,"SI","Por monto de crédito y valor de la vivienda","Adquisicion","Tradicional",5,"Baja California",{"$f":"IF($N$20=\"VERDADERO\",$N$28,0.3174)","v":0.31740000000000002},null,null,null,null,null,null,null,null,null,null,null,null,null,null,null,null,null,null,null,null,null,null,null,null,null,null,null,null,null,null,null,null,null,null,null,null,null,null,null,null,"AdquisicionPremier50.9",20.86,null,"AdquisicionPremier50.9",20.260000000000002]
[null,null,null,null,null,null,null,null,null,null,null,"NO","Por ingresos del cliente","Pago de Hipoteca","Apoyo Infonavit",10,"Baja California Sur",0.31740000000000002,null,"Segment","Premier",null,null,null,"No premier",null,null,null,null,null,null,null,null,null,null,null,"Exclusiva",null,null,null,"Pago Hipoteca",null,null,null,"Liquidez Premier",null,null,"Liquidez No Premier",null,null,null,null,null,"Nómina Especial",null,null,null,null,"AdquisicionPremier100.9",12.91,null,"AdquisicionPremier100.9",12.16]
[null,null,{"$f":"TODAY()","v":"2025-09-03"},null,null,null,null,null,null,null,null,"AdquisicionNo PremierTradicional","Por Valor de la Vivienda","Liquidez","Cofinavit",15,"Campeche",0.31740000000000002,null,null,"5 años","10años","15años","20años","5 años","5 años","5 años","10años","10años","10años","15años","15años","20años","20años","20años","20años","5 años","10años","15años","20años","5 años","10años","15años","20años","5 años","10años","15años","5 años","5 años","10años","10años","15años","15años","5 años","10años","15años","20años",null,"AdquisicionPremier150.9",10.56,null,"AdquisicionPremier150.9",9.6999999999999993]
[null,null,null,null,null,null,null,null,null,null,null,"AdquisicionPremierTradicional","Por Campaña","Exclusiva","CI+CB",{"$f":"IF(D21=N6,\"\",20)","v":20},"Coahuila",0.31740000000000002,null,"Rate",9.1999999999999998E-2,9.4500000000000001E-2,9.7000000000000003E-2,9.7000000000000003E-2,9.5000000000000001E-2,9.9999999999999992E-2,0.104,9.7500000000000003E-2,0.10249999999999999,0.1065,0.1,0.105,0.109,0.1,0.105,0.109,9.6999999999999989E-2,9.9499999999999991E-2,0.10199999999999999,0.10199999999999999,9.1999999999999998E-2,9.4500000000000001E-2,9.7000000000000003E-2,9.7000000000000003E-2,0.11499999999999999,0.11749999999999999,0.12,0.12,0.13,0.1225,0.13250000000000001,0.125,0.13500000000000001,9.4E-2,9.6500000000000002E-2,9.9000000000000005E-2,9.9000000000000005E-2,null,"AdquisicionPremier200.9",9.4499999999999993,null,"AdquisicionPremier200.9",8.5]
[null,null,null,null,null,null,null,null,null,null,null,"Perfil",null,"Pago Hipoteca+Liquidez","Alia2",{"$f":"IF(AND(D21=\"Exclusiva\",D22=\"Tradicional\"),25,IF(OR(D22=O5,D22=O6,$D$21&$D$22&N20=$N$24),25,\"\"))","v":25},"Colima",0.31740000000000002,null,"Opening Fee",0,0,0,0,0.01,0.01,0.01,0.01,0.01,0.01,0.01,0.01,0.01,0.01,0.01,0.01,0.01,0.01,0.01,0.01,0,0,0,0,0,0,0,1.4999999999999999E-2,1.4999999999999999E-2,1.4999999999999999E-2,1.4999999999999999E-2,1.4999999999999999E-2,1.4999999999999999E-2,0,0,0,0,null,"AdquisicionNo Premier50.5",21,null,"AdquisicionNo Premier50.5",20.41]
[null,null,"Nombre del ejecutivo",null,null,"Teléfono",null,null,null,null,null,null,null,"Nomina Especial","Casa con casa",null,"Chiapas",0.31740000000000002]
[null,null,"Nombre del cliente",null,null,"Teléfono",null,null,null,null,null,null,null,null,null,null,"Chihuahua",0.31740000000000002]
[null,null,"Conjunto",null,null,null,null,null,null,null,null,null,"AdquisicionNo PremierCI+CB",null,null,null,"Ciudad de México",0.31740000000000002]
[null,null,null,null,null,null,null,null,null,null,null,null,"AdquisicionPremierCI+CB",null,null,null,"Durango",0.31740000000000002]
[null,null,null,null,null,null,null,null,null,null,null,null,null,null,null,null,"Estado de México",0.31740000000000002]
[null,null,"Instrucciones: Llenar solo los campos en gris claro.",null,null,null,null,null,null,null,null,null,"AdquisicionNo PremierCasa con casa",{"$f":"L189","v":"Pago Hipoteca+LiquidezAlto Valor"},null,null,"Guanajuato",0.31740000000000002]
[null,null,"Datos del Cliente",null,null,"Resultados",null,null,null,null,null,null,"AdquisicionPremierCasa con casa",null,null,null,"Guerrero",0.31740000000000002]
[null,null,"Perfil Cliente","No Premier",null,"Desembolso inicial",null,null,null,null,null,null,"AdquisicionNo PremierApoyo Infonavit",null,null,null,"Hidalgo",0.31740000000000002]
[null,null,"¿Es cliente Nómina HSBC?","NO",null,{"$f":"IF(G17>=0,\"Enganche\",\"\")","v":"Enganche"},{"$f":"IFERROR(IF(J4<>\"\",\"-\",IF(D21=V78,0,IF(D21=V79,0,IF(D21=V80,0,D26-IF(D22=O8,D32+D33+H25,IF(D22=O7,D33+H25,IF(D22=O6,D32+D33+H25,H25))))))),0)","v":90000},null,null,null,null,null,"AdquisicionNo PremierCofinavit",{"$f":"9.8%-IF(D28=5,0%,IF(D28=10,0%,0))","v":9.8000000000000004E-2},null,null,"Jalisco",0.31740000000000002]
[null,null,"Estado Vivienda","Ciudad de México",null,"Gasto de Preoriginación - Avalúo Hipotecario",{"$f":"IF(AND(D21=\"Adquisicion\",D22=\"Tradicional\"),0,IF(OR(D21&D22&N20=N22,D21&D22&N20=N23,D21&D22&N20=N24),0,VLOOKUP(D26,Q71:R79,2)))","v":9222},null,null,null,null,null,null,null,null,null,"Michoacán",0.31740000000000002]
[null,null,null,null,null,"C. Contratación Crédito",{"$f":"IF(N20=TRUE,0%,\nIF(AND(OR(D22=\"Cofinavit\",D22=\"Apoyo Infonavit\"),D16=\"Premier\",F19=\"C. Contratación Crédito\"),0.5%,\nIF(AND(OR(D22=\"Cofinavit\",D22=\"Apoyo Infonavit\"),D16=\"Premier\",F19=\"C. Penalización Pago Anticipado\"),1.5%,\nIF(AND(OR(D22=\"Cofinavit\",D22=\"Apoyo Infonavit\"),D16=\"No Premier\",F19=\"C. Contratación Crédito\"),0.5%,\nIF(AND(OR(D22=\"Cofinavit\",D22=\"Apoyo Infonavit\"),D16=\"No Premier\",F19=\"C. Penalización Pago Anticipado\"),2.5%,\nIF(F19=\"Sin C Contratación Crédito\",0%,0%\n\n))))))","v":5.0000000000000001E-3},{"$f":"IF(F19=\"C. Penalización Pago Anticipado\",0,IFERROR(IF($D$25=\"Por ingresos del cliente\",$N$58,IF($D$27=0,$M$83,$M$83))*G19,0))","v":13500},null,null,null,null,"C. Contratación Crédito","Hipoteca Verde?",null,null,"Morelos",0.31740000000000002]
[null,null,"Datos del crédito",null,null,"Gastos de Investigación",{"$f":"IF(D21=N8,0,0)","v":0},null,null,null,null,null,"C. Penalización Pago Anticipado",false,null,null,"Nayarit",0.31740000000000002]
{"$rows_left_out":249}
{"sheet":"Amortización","index":2,"n_rows":330,"n_cols":63,"rows_kept":330,"cut":false,"hidden":false,"merged":[[320,47,320,48],[2,47,2,49],[322,2,322,16],[323,2,323,16],[324,2,325,16],[2,6,2,8],[13,4,13,5],[4,11,4,16],[7,4,7,5],[8,4,8,5],[9,4,9,5],[10,4,10,5],[7,16,7,17],[326,2,327,16],[14,4,14,5],[16,4,16,5],[320,2,320,3],[15,4,15,5]]}
[null,null,null,null,null,null,null,null,null,null,null,null,null,null,null,null,null,null,null,null,null,"SI",null,{"$f":"Resumen!D28","v":20},null,null,null,{"$f":"IF(X1=5,60,IF(X1=10,120,IF(X1=15,180,IF(X1=20,240))))","v":240},null,null,{"$f":"V1&0","v":"SI0"}]
[null,null,null,null,null,null,null,null,null,null,null,null,null,null,null,null,null,null,null,null,null,"NO",null,{"$f":"IF(E16=V1,3,0)","v":0},null,null,null,null,null,null,{"$f":"COUNT(F21:F320)","v":198},null,null,"verde?"]
[null,null,null,null,null,null,"CREDITO HIPOTECARIO",null,null,null,null,null,null,null,null,null,null,null,null,null,null,null,null,null,null,null,null,null,null,null,null,null,null,{"$f":"Resumen!N20","v":false},null,null,null,null,null,null,null,null,null,null,null,null,null,"CREDITO CI +CB"]
[null,null,"Tabla de amortización",null,null,null,"Mensualidad",null,null,null,null,null,null,null,null,null,null,null,null,null,null,null,null,"Pago FijoSI"]
[null,null,null,null,null,{"$f":"IF(E7=\"Pago de Hipoteca\",E7&Resumen!D28&Resumen!O50,IF(E7&E9=\"AdquisicionPremier\",Amortización!E7&Amortización!E9&Resumen!D28&90%,IF(E7&E9=\"LiquidezPremier\",E7&E9&Resumen!D28&70%,E7&E9&Resumen!D28&Resumen!O50)))","v":"AdquisicionNo Premier200.9"},"plazo",{"$f":"E8&E11","v":"Adquisicion"},null,null,null,{"$f":"TODAY()","v":"2025-09-03"}]
[]
[null,null,"Datos Generales",null,{"$f":"IF(E8&E9=Resumen!N7&Resumen!L40,Resumen!N4,Amortización!E8)","v":"Adquisicion"},null,null,{"$f":"IF(E10=\"CI+CB\", \"Datos del crédito HSBC - CI+CB\", \"Datos del crédito\")","v":"Datos del crédito"},null,null,null,null,null,null,null,null,null,null,null,null,"Producto",null,null,null,null,null,null,null,null,null,null,null,null,null,null,null,{"$f":"K11/12","v":20},"Plazo",null,null,null,null,null,null,null,null,null,"Datos del crédito INFONAVIT - CI+CB"]
[null,null,"Producto",null,{"$f":"Resumen!D21","v":"Adquisicion"},null,null,"Monto de Vivienda",null,null,{"$f":"Resumen!D26","v":3000000},null,{"$f":"IF(E16=\"SI\",\"Intereses Diferidos\",\"\")","v":""},null,null,null,{"$f":"IF(E16=\"SI\",MAX(0,(F24*3)-AG19),\"\")","v":""},null,null,null,"Adquisicion",null,null,"Pago Fijo",null,null,null,"AdquisicionNo Premier15Pago Fijo",null,null,null,null,null,null,null,null,null,null,null,null,null,null,null,null,null,null,null,"Monto de Vivienda"]
[null,null,"Tipo de cliente",null,{"$f":"Resumen!D16","v":"No Premier"},null,null,"Crédito",null,null,{"$f":"IF(H5=\"Pago Hipoteca+LiquidezPago de Hipoteca\",Resumen!D31,IF(H5=\"Pago Hipoteca+LiquidezLiquidez\",Resumen!H25-Resumen!D31,IF(E10=Resumen!O7,Resumen!G32,Resumen!H25)))","v":2910000},null,{"$f":"IF(M8=\"\",\"\",\"Los prepagos liquidan inicialmente los intereses diferidos\")","v":""},null,null,null,null,null,null,null,"Pago de Hipoteca",null,null,"Pago Bajo",null,null,null,"AdquisicionNo Premier20Pago Fijo",null,null,null,null,null,null,null,null,{"$f":"C8&C9&AL7&H10","v":"ProductoTipo de clientePlazoTasa anual"},null,null,null,null,null,"Plazo&Tasa",null,null,null,null,"Crédito",null,null,{"$f":"IF(E10=\"CI+CB\",Resumen!G33,0)","v":0}]
[null,null,{"$f":"IF(OR(E8=U11,E8=U10),\"Esquema\",\"Tipo de financiamiento\")","v":"Tipo de financiamiento"},null,{"$f":"IF(OR(E8=U11,E8=U10),\"Pago Fijo\",Resumen!D22)","v":"Apoyo Infonavit"},null,null,"Tasa anual",null,null,{"$f":"Resumen!G26","v":9.8000000000000004E-2},null,null,null,null,null,null,null,null,null,"Liquidez",null,null,null,null,null,null,{"$f":"K11/12","v":20},null,null,null,null,null,null,null,null,{"$f":"E8&E9&AK7&K10","v":"AdquisicionNo Premier200.098"},null,null,null,null,null,{"$f":"AK7&K10","v":"200.098"},null,null,null,null,"Tasa anual",null,null,0.1045]
[null,null,{"$f":"IF(E8=U11,\"Tabla a simular\",\"\")","v":""},null,null,null,null,"Plazo en meses",null,null,{"$f":"Resumen!$D$28*12","v":240},null,null,null,null,null,null,null,null,null,"Pago Hipoteca+Liquidez",null,null,null,null,null,null,null,null,null,null,null,null,null,null,null,null,null,null,null,null,null,null,null,null,null,null,"Plazo en meses",null,null,{"$f":"Resumen!$D$28*12","v":240}]
[null,null,null,null,null,null,null,{"$f":"Resumen!$F$19","v":"C. Contratación Crédito"},null,null,{"$f":"IF(H12=\"Comisión por apertura\",Resumen!$G$19, Resumen!$G$19)","v":5.0000000000000001E-3},null,null,null,null,null,null,null,null,null,"Exclusiva",null,null,null,null,null,null,null,null,null,null,null,null,null,null,null,null,null,null,null,null,null,null,null,null,null,null,"Mensualidad",null,null,{"$f":"MAX(BD21:BD260)","v":0}]
[null,null,"Opciones de pago",null,null,null,null,"Gasto de Preoriginación - Avalúo Hipotecario",null,null,{"$f":"Resumen!G18","v":9222},null,null,null,null,null,null,null,null,null,"Apoyo Infonavit","Apoyo InfonavitAdquisicion",null,null,null,null,null,"Seguro de Daños",null,null,{"$f":"VLOOKUP(Resumen!D18,Resumen!Q3:R39,2,0)/1000","v":3.1740000000000002E-4},null,2.92E-4,"daños verde",null,null,null,null,null,null,null,null,null,null,null,null,null,"Comisión por administración",null,null,0.01]
[null,null,{"$f":"IF(E8=U10,\"\",IF(E8=U11,\"\",IF(E8=U9,\"Esquema\",\"Esquema\")))","v":"Esquema"},null,"Pago Bajo",null,null,"Plazo para liquidación",null,null,{"$f":"IF(K9=\"-\",\"-\",COUNT($D$20:$D$320))","v":198},null,null,null,null,null,null,null,null,null,"Infonavit",null,null,null,null,null,null,"Comisión por administración",null,null,{"$f":"IF(OR(E8&E9=\"AdquisicionPremier\",Resumen!D21=Resumen!N8),\"0\",IF(OR(E8=\"Exclusiva\",E10=\"Apoyo Infonavit\", E10= \"Cofinavit\",Resumen!N20=\"VERDADERO\"),\"0\",IF(E8&E9=\"AdquisicionNo Premier\",250,IF(OR(E8=\"Pago de Hipoteca\",E8=\"nomina Especial\"),\"0\",250))))","v":"0"},null,0.37,"vida verde",null,null,null,null,null,null,null,null,null,null,null,null,null,"Plazo para liquidación",null,null,{"$f":"IF(AY9=\"-\",\"-\",COUNT($D$20:$D$320))","v":198}]
[null,null,"Tipo prepago",null,"Plazo",null,null,{"$f":"\"Factor \"&IF(E10=\"Pago Fijo\",\"Pago Fijo\",E14)","v":"Factor Pago Bajo"},null,null,{"$f":"IF(E14=X9,VLOOKUP(AQ10,AQ17:AR89,2,0),PMT($K$10/12,$K$11,-1000))","v":8.4},null,null,null,null,null,null,null,null,null,"Apoyo Infonavit",null,null,null,null,null,null,null,null,null,null,null,null,null,null,null,null,null,null,null,null,null,null,null,null,null,null,{"$f":"\"Factor \"&IF(AS10=\"Pago Fijo\",\"Pago Fijo\",AS14)","v":"Factor "},null,null,{"$f":"PMT($AY$10/12,$AY$11,-1000)","v":9.9502351152528394}]
[null,null,{"$f":"IF(C12=\"\",\"\",IF(E14=X9,\"\",\"Skip Payment\"))","v":""},null,"NO"]
[null,null,"Ingreso mensual",null,{"$f":"IF(OR(Resumen!D21&Resumen!D22=Resumen!O60,Resumen!D21&Resumen!D22=Resumen!O61,Resumen!D21&Resumen!D22=Resumen!O62),MIN(IF(Resumen!D29=\"\",0,Resumen!D29),3439.46*25),0)","v":50000},null,null,"CAT*",null,null,{"$f":"IF(ISERROR(((1+IRR(V20:V320))^(12))-1),\"-\",(((1+IRR(V20:V320))^(12))-1))","v":0.11391608577046108},null,null,null,null,null,null,null,null,null,null,null,null,null,null,null,null,null,null,null,null,null,null,null,null,null,"AdquisicionPremier50.084",19.770000000000003,null,null,5,{"$f":"AP18-0.25%","v":9.8799999999999999E-2},{"$f":"AO17&AP17","v":"50.0988"},20.48,null,null,null,"CAT*",null,null,{"$f":"IF(ISERROR(((1+IRR(BK20:BK320))^(12))-1),\"-\",(((1+IRR(BK20:BK320))^(12))-1))","v":"-"}]
[null,null,null,null,null,null,null,null,null,null,null,null,null,null,null,null,null,null,null,null,null,null,null,null,null,null,null,null,null,null,null,null,null,null,null,null,"AdquisicionPremier50.084",19.770000000000003,null,null,10,{"$f":"AP19-0.25%","v":0.1013},{"$f":"AO18&AP18","v":"100.1013"},12.39]
[null,null,"Mes","Saldo Inicial","Pago a Capital","Interes","Seguro de Vida ","Seguro de Daños ","Comisión por Administración - Renta",{"$f":"IF(OR(E11=Resumen!N6,E8=Resumen!N6),\"Iva Sobre Intereses\",\"\")","v":""},"Pago Mensual Total","Saldo Final","Pago Anticipado","Pago Anticipado a Capital","Comisión Pago Anticipado","IVA Comisión P. Anticipado ","Aportación Infonavit","Tasa de Interes",null,null,"Flujo sin IVA","Flujo CAT",null,"FACTOR","IVA",null,null,null,null,null,null,null,{"$f":"SUM(M21:M320)","v":0},"Intereses diferidos por pagar","Prepago a saldo",null,"AdquisicionPremier50.084",19.770000000000003,null,null,15,{"$f":"AP20","v":0.1038},"150.1038",9.94,null,null,null,"Mes","Saldo Inicial","Pago a Capital","Intereses","Seguro de Vida ","Seguro de Daños ","Comisión por Administración",{"$f":"IF(OR(AX11=Resumen!BD6,AX8=Resumen!BD6),\"Iva Intereses\",\"\")","v":""},"Mensualidad Total","Saldo Final","Prepago",null,"Tasa de Interes",null,null,"Flujo sin IVA"]
[null,null,0,null,null,null,null,null,null,null,{"$f":"IF(D20=\"\",\"\",E20+F20+G20+H20+I20)","v":""},{"$f":"K9","v":2910000},null,null,null,null,null,null,null,0,{"$f":"IF(ISNUMBER(K9),-K9,0)+IF(H12=\"Comisión por apertura\",IF(ISNUMBER(K12),K12*K9,0),0)+IF(ISNUMBER(K13),K13/1.16,0)+IF(ISNUMBER(Resumen!G20),Resumen!G20/1.16)","v":-2902050},{"$f":"IF(ISNUMBER(K9),-K9,0)+IF(H12=\"C. Contratación Crédito\",IF(ISNUMBER(K12),K12*K9,0),0)+IF(ISNUMBER(K13),K13/1.16,0)+IF(ISNUMBER(Resumen!G20),Resumen!G20/1.16)","v":-2887500},null,null,null,null,null,null,null,null,null,null,"Prepago real",{"$f":"IF(E16=\"no\",0,K9*K10*3/12)","v":0},null,null,"AdquisicionPremier100.0865",11.61,null,null,20,{"$f":"AP21","v":0.1038},"200.1038",8.76,null,null,null,0,null,null,null,null,null,null,null,{"$f":"IF(AW20=\"\",\"\",AX20+AY20+AZ20+BA20+BB20)","v":""},{"$f":"BD9","v":0},null,null,null,null,0,{"$f":"IF(ISNUMBER(AY9),-AY9,0)+IF(ISNUMBER(AY12),AY12,0)+IF(ISNUMBER(AY13),AY13/1.16,0)+IF(ISNUMBER(Resumen!AW20),Resumen!AW20/1.16)","v":8.6206896551724154E-3}]
{"$rows_left_out":311}
{"sheet":"Oferta Vinculante","index":3,"n_rows":5,"n_cols":6,"rows_kept":5,"cut":false,"hidden":false,"merged":[[1,2,1,6]]}
[]
[null,null,"Oferta Vinculante"]
[]
[]
[null,null,null,"Oferta Pago Fijo",null,"Oferta Pago Bajo"]