{"text_format":"1","workbook":"xlsx","n_sheets":6,"sheets":["Hipoteca Free","anticipos","RESTO DE PRODUCTOS","requisitos","CALCULO Empleados","Análisis Costos"],"not_rendered":{"charts":0,"images":1,"macros":1,"external_links":0,"defined_names":4,"comments":0,"pivot_tables":0},"unopened":[],"bounds":{"document_bytes":16777216,"sheet_cells":100000,"rows_first":2000,"rows_last":500,"rows_between":2000,"halvings":0,"cell_chars":16384,"cell_head_chars":4096},"cells_cut":0,"cells_raw":0,"read":"whole","date_system":"1900"}

{"sheet":"Hipoteca Free","index":0,"n_rows":120,"n_cols":256,"rows_kept":120,"cut":false,"hidden":false,"merged":[[63,15,63,19],[67,16,67,18],[68,5,68,11],[68,14,68,17],[69,16,69,18],[70,4,70,5],[70,7,70,11],[70,14,70,17],[105,0,105,5],[105,7,105,19],[89,1,89,19],[91,7,91,19],[92,7,96,19],[97,7,99,19],[100,7,101,19],[102,7,103,19],[104,7,104,19],[16,4,16,6],[16,9,16,14],[16,16,16,19],[19,7,19,9],[20,0,20,9],[19,10,19,13],[21,0,23,10],[21,13,21,16],[22,11,22,12],[22,14,22,19],[23,14,23,19],[24,8,25,13],[26,11,28,19],[39,12,40,19],[45,5,45,9],[58,14,59,16],[51,12,51,14],[52,13,52,14],[53,12,53,14],[54,12,54,14],[14,13,14,14],[2,9,2,19],[3,16,3,19],[4,16,4,19],[5,16,5,19]]}
[]
[]
[null,null,null,null,null,null,null,null,null,{"$f":"+IF(requisitos!I14=9,\"SOLICITUD DE AVALUO Y ESTUDIO DE COSTOS\",IF(requisitos!I14=10,\"SOLICITUD DE AVALUO Y ESTUDIO DE COSTOS\",\"SOLICITUD AVALUO\"))","v":"SOLICITUD AVALUO"}]
[null,null,null,null,null,null,null,null,null,null,null,null,null,null,null,null,"HIPOTECARIO"]
[null,null,null,null,null,null,null,null,null,null,null,null,null,null,null,null,"FECHA DE EXPEDICIÓN"]
["BANCO SANTANDER MEXICO,SOCIEDAD ANONIMA, INSTITUCION DE BANCA MULTIPLE.",null,null,null,null,null,null,null,null,null,null,null,null,null,null,null,{"$f":"NOW()","v":"2025-07-08T14:38:15.680"}]
["Grupo Financiero Santander."]
[]
[]
[null,null,"EMPLEADO",null,null,null,null,"CLIENTE EXTERNO",null,null,null,"FAVOR DE MARCAR CON EL CURSOR LA OPCION CORRESPONDIENTE."]
[]
[]
[null,null,null,null,null,null,null,null,null,null,null,null,null,null,{"$f":"+IF(requisitos!I14=3,requisitos!R14,'CALCULO Empleados'!M21)","v":false},null,{"$f":"+IF(O13<18000,O13,18000)","v":18000}]
[null,null,null,null,null,null,null,null,null,null,null,null,null,null,null,null,{"$f":"IF(requisitos!I14=3,requisitos!R14,IF(requisitos!I14=4,requisitos!R15,IF(requisitos!I14=5,requisitos!R16,IF(requisitos!I14=9,requisitos!R20,IF(requisitos!I14=10,requisitos!R21,IF(requisitos!I14=11,requisitos!O22,requisitos!R12))))))","v":1913}]
[{"$f":"IF(requisitos!$T$3=2,\"FUNCIONARIO QUE ATIENDE AL CLIENTE\",\"DATOS DEL EMPLEADO\")","v":"FUNCIONARIO QUE ATIENDE AL CLIENTE"},null,null,null,null,null,null,null,null,null,null,null,null,{"$f":"+IF(Q15<1412.88,\"$1,413.00\",Q15)","v":1913},null,null,{"$f":"+IF(requisitos!T3=1,'Hipoteca Free'!Q13,'Hipoteca Free'!Q14)","v":1913}]
{"$rows_left_out":106}
{"sheet":"anticipos","index":1,"n_rows":18,"n_cols":5,"rows_kept":18,"cut":false,"hidden":true,"merged":[[0,1,1,1],[0,3,1,3],[0,4,1,4]]}
[null,"TIPO",null,"RANGO DE VALOR VIVIENDA","PROPUESTA COBRO MERCADO ABIERTO"]
[]
[1,"HIPOTECA FREE",1]
[null,"HIPOTECA INTEGRAL",null,"menos de 500,000",2000]
[null,"OTROS",null,"de 500,001 a 1,000,000",3000]
[null,null,null,"de 1,000,001 a 1,500,000",4500]
[null,null,null,"de 1,500,001 a 2,000,000",6000]
[null,null,null,"de 2,000,001 a 2,500,000",7000]
[null,null,null,"de 2,500,001 a 3,000,000",9000]
[null,null,null,"de 3,000,001 a 3,500,000",10000]
[null,null,null,"de 3,500,001 a 4,000,000",11000]
[null,null,null,"de 4,000,001 a 4,500,000",13500]
[null,null,null,"de 4,500,001 a 5,500,000",14000]
[null,null,null,"de 5,500,001 a 6,000,000",17000]
[null,null,null,"de 6,000,001 a 6,500,000",19000]
{"$rows_left_out":4}
{"sheet":"RESTO DE PRODUCTOS","index":2,"n_rows":120,"n_cols":256,"rows_kept":120,"cut":false,"hidden":false,"merged":[[104,7,104,19],[105,0,105,5],[105,7,105,19],[89,1,89,19],[91,7,91,19],[92,7,96,19],[97,7,99,19],[100,7,101,19],[102,7,103,19],[70,14,70,17],[39,12,40,19],[45,5,45,9],[58,14,59,16],[52,13,52,14],[51,12,51,14],[53,12,53,14],[54,12,54,14],[67,16,67,18],[68,5,68,11],[68,14,68,17],[69,16,69,18],[70,4,70,5],[70,7,70,11],[31,0,31,10],[25,11,25,12],[25,14,25,19],[26,14,26,19],[24,13,24,16],[19,7,19,9],[20,0,20,9],[21,0,23,10],[22,11,22,12],[16,4,16,6],[16,9,16,14],[19,13,19,18],[19,10,19,12],[16,16,16,19],[2,9,2,19],[3,16,3,19],[4,16,4,19],[5,16,5,19],[14,13,14,14]]}
[]
[]
[null,null,null,null,null,null,null,null,null,{"$f":"+IF(requisitos!I14=9,\"SOLICITUD DE AVALUO Y ESTUDIO DE COSTOS\",IF(requisitos!I14=10,\"SOLICITUD DE AVALUO Y ESTUDIO DE COSTOS\",\"SOLICITUD AVALUO\"))","v":"SOLICITUD AVALUO"}]
[null,null,null,null,null,null,null,null,null,null,null,null,null,null,null,null,"HIPOTECARIO"]
[null,null,null,null,null,null,null,null,null,null,null,null,null,null,null,null,"FECHA DE EXPEDICIÓN"]
["BANCO SANTANDER MEXICO,SOCIEDAD ANONIMA, INSTITUCION DE BANCA MULTIPLE.",null,null,null,null,null,null,null,null,null,null,null,null,null,null,null,{"$f":"NOW()","v":"2025-07-08T14:38:15.680"}]
["Grupo Financiero Santander."]
[]
[]
[null,null,null,null,null,null,null,null,null,null,null,"FAVOR DE MARCAR CON EL CURSOR LA OPCION CORRESPONDIENTE."]
[]
[]
[null,null,null,null,null,null,null,null,null,null,null,null,null,null,{"$f":"+IF(requisitos!I14=3,requisitos!R14,'CALCULO Empleados'!M21)","v":false},null,{"$f":"+IF(O13<18000,O13,18000)","v":18000}]
[null,null,null,null,null,null,null,null,null,null,null,null,null,null,null,null,{"$f":"IF(requisitos!I14=3,requisitos!R14,IF(requisitos!I14=4,requisitos!R15,IF(requisitos!I14=5,requisitos!R16,IF(requisitos!I14=9,requisitos!R20,IF(requisitos!I14=10,requisitos!R21,IF(requisitos!I14=11,requisitos!O22,requisitos!R12))))))","v":1913}]
[{"$f":"IF(requisitos!$T$3=2,\"FUNCIONARIO QUE ATIENDE AL CLIENTE\",\"DATOS DEL EMPLEADO\")","v":"FUNCIONARIO QUE ATIENDE AL CLIENTE"},null,null,null,null,null,null,null,null,null,null,null,null,{"$f":"+IF(Q15<1412.88,\"$1,413.00\",Q15)","v":1913},null,null,{"$f":"+IF(requisitos!T3=1,'RESTO DE PRODUCTOS'!Q13,'RESTO DE PRODUCTOS'!Q14)","v":1913}]
{"$rows_left_out":106}
{"sheet":"requisitos","index":3,"n_rows":75,"n_cols":32,"rows_kept":75,"cut":false,"hidden":true,"merged":[[9,18,9,23]]}
[]
[null,null,null,null,null,null,null,null,null,null,null,null,null,null,null,null,null,null,null,null,null,null,null,null,null,null,null,null,null,null,1,"CASA SOLA"]
[null,null,"tipo",null,null,"requisitos",null,null,"OTROS",null,null,null,null,null,"PROCEDE O NO",null,null,null,null,2,{"$f":"VLOOKUP(T3,T4:U5,2,FALSE)","v":{"$error":"#N/A"}},null,null,null,null,null,{"$f":"+T3+I14","v":3},null,null,null,null,"CASA EN CONDOMINIO"]
[null,1,"INMOBILIARIO",null,null,"CONOCER EL VALOR Y/O RENTA",null,null,"FOTOGRAFÍAS",null,null,null,null,null,{"$f":"IF('Hipoteca Free'!#REF!=FALSE,\"\",1)","v":{"$error":"#REF!"}},null,null,null,null,3,"EN EL ESTADO EN QUE SE ENCUENTRA",null,null,null,null,null,null,null,null,null,null,"DEPARTAMENTO"]
[null,"1+4","MAQUINARIA Y EQUIPO",null,null,"AUXILIAR COMPRA O VENTA",null,null,"CROQUIS DE LOCALIZACION",null,null,null,null,null,{"$f":"IF('Hipoteca Free'!#REF!=FALSE,\"\",1)","v":{"$error":"#REF!"}},null,null,null,null,4,"COMPLETAMENTE TERMINADO",null,null,null,null,null,null,null,null,null,null,"TERRENO"]
[null,4,"AGROPECUARIO",null,null,"DETERMINAR BASE GRAVABLE",null,null,"AVALÚO DE OTRO BANCO",null,null,null,null,null,{"$f":"IF('Hipoteca Free'!#REF!=FALSE,\"\",1)","v":{"$error":"#REF!"}},null,null,null,null,null,null,null,null,null,null,null,null,null,null,null,null,{"$f":"+IF(I13=8,\"\",IF(I13=9,\"\",\"OTRO\"))","v":"OTRO"}]
[null,2,"OBRAS DE ARTE",null,null,"DAR EN GARANTIA",null,null,"NINGUNO",null,null,null,null,null,{"$f":"SUM(O4:O6)","v":{"$error":"#REF!"}},null,null,null,{"$f":"'Hipoteca Free'!$H$20","v":0},null,null,null,{"$f":"IF(AND($S$7>16000000),$X$31,IF(AND($S$7<=16000000,$S$7>8000000),$X$30,IF(AND($S$7<=8000000,$S$7>4000000),$X$29,IF(AND($S$7<=4000000,$S$7>2000000),$X$28,IF(AND($S$7<=2000000,$S$7>1000000),$X$27,IF(AND($S$7<=1000000,$S$7>500000),$X$25,IF(AND($S$7<=500000,$S$7>320000),$X$24,920)))))))","v":920},{"$f":"IF(AND($S$7>16000000),$W$31,IF(AND($S$7<=16000000,$S$7>8000000),$W$30,IF(AND($S$7<=8000000,$S$7>4000000),$W$29,IF(AND($S$7<=4000000,$S$7>2000000),$W$28,IF(AND($S$7<=2000000,$S$7>1000000),$W$27,IF(AND($S$7<=1000000,$S$7>500000),$W$25,IF(AND($S$7<=500000,$S$7>=320000),$W$24,920)))))))","v":920}]
[null,null,"VEHICULOS TERRESTRES",null,null,"RECIBIR O DAR EN PAGO",null,null,4,null,null,null,"PLANOS"]
[null,null,"VEHICULOS AÉREOS",null,null,"ANALIZAR UN PROYECTO",null,null,1,null,null,null,"NO","SI"]
[null,null,"VEHICULOS MARÍTIMOS",null,null,"CRÉDITO HIPOTECARIO",null,null,null,null,null,null,"SI","NO",0,null,null,null,"TABLA DE CALCULO PARA EMPLEADOS (NO BORRAR)"]
[null,null,"OTROS",null,null,"OTRO",null,null,null,null,null,null,null,null,{"$f":"2.75/1000","v":2.7499999999999998E-3}]
[null,null,{"$f":"I14","v":1},null,null,9,null,null,null,null,null,null,"ADQUISICIÓN // LIQUIDEZ",null,{"$f":"+'Hipoteca Free'!$H$20*requisitos!$O$11","v":0},{"$f":"+IF($I$9=1,\"500\",0)","v":"500"},{"$f":"+P12+O12","v":500},{"$f":"+IF('Hipoteca Free'!$H$20<=420000,1413+requisitos!P12,IF(Q12<=18000,Q12,18000))","v":1913}]
[null,null,null,null,null,null,null,null,null,null,null,null,"ADQUISICIÓN CON APOYO INFONAVIT",null,{"$f":"+'Hipoteca Free'!$H$20*requisitos!$O$11","v":0},"500",500,{"$f":"+IF('Hipoteca Free'!$H$20<=420000,1413+requisitos!P13,IF(Q13<=18000,Q13,18000))","v":1913}]
[null,null,1,1,"CONDOMINIO",null,null,null,1,null,null,null,"SUSTITUCIÓN DE HIPOTECA",null,2320,"500",2820,{"$f":"+Q14","v":2820},{"$f":"+IF(T3=1,'CALCULO Empleados'!M21,requisitos!R14)","v":2820}]
[null,null,null,2,"PRIVADO",null,null,null,null,null,null,null,"MEJORA DE CONDICIONES",null,3000,"500",3500,{"$f":"+Q15","v":3500},{"$f":"VALUE('Hipoteca Free'!$H$20)","v":0}]
{"$rows_left_out":61}
{"sheet":"CALCULO Empleados","index":4,"n_rows":628,"n_cols":29,"rows_kept":628,"cut":false,"hidden":true,"merged":[]}
[]
[null,"ARANCEL PARA PAGO A UNIDADES DE VALUACIÓN Y COBRO A EMPLEADOS "]
[]
[null,"AVALUOS DE INMUEBLES"]
[null,null,"Base: ","Sobre el valor real del bien valuado"]
[null,null,"Cuota Mínima","$ 1413.00 (IVA Incluído)"]
[]
[null,null,null,null,null,null,null,null,null,null,null,null,"MAS CUOTA FIJA"]
[null,"RANGO DE","LIMITE",null,"CUOTA","TASA",null,null,"VALOR COMERCIAL","LIMITE",null,"DIF. * TASA","(VALOR DEL AVALUO)"]
[null,"LIMITE INFERIOR","LIMITE SUPERIOR","FIJA","MARGINAL",null,null,"VALOR COMERCIAL","INFERIOR","DIFERENCIA","MARGINAL","más CUOTA FIJA","IVA","TOTAL"]
[null,1,320000,1217.3900000000001,0,0,null,219000,1,{"$f":"H11-I11","v":218999},{"$f":"J11*E11","v":0},{"$f":"D11","v":1217.3900000000001},{"$f":"L11*0.16","v":194.78240000000002},{"$f":"L11+M11","v":1412.1724000000002}]
[null,320001,500000,1218,null,0,null,{"$f":"$M$20","v":0},{"$f":"1","v":1},-1,0,{"$f":"D12","v":1218},{"$f":"L12*0.16","v":194.88},{"$f":"(L12+M12)","v":1412.88}]
[null,500001,1000000,1250,2.3800000000000002E-3,2.38,null,{"$f":"$M$20","v":0},{"$f":"B13","v":500001},-500001,{"$f":"J13*E13","v":-1190.0023800000001},{"$f":"(K13+D13)*0.9","v":53.997857999999887},{"$f":"L13*0.16","v":8.639657279999982},{"$f":"L13+M13","v":62.637515279999867}]
[null,1000001,2000000,2440,2.1800000000000001E-3,2.1800000000000002,null,0,1000001,-1000001,-2180.00218,233.99803800000004,37.439686080000008,271.43772408000007]
[null,2000001,4000000,4620,1.89E-3,1.89,null,0,2000001,-2000001,-3780.00189,755.99829899999997,{"$f":"L15*0.16","v":120.95972784},876.95802684]
{"$rows_left_out":614}
{"sheet":"Análisis Costos","index":5,"n_rows":21,"n_cols":10,"rows_kept":21,"cut":false,"hidden":true,"merged":[[1,4,1,5],[1,6,1,7],[1,8,1,9]]}
[null,null,null,null,2.75,null,2.75,null,2.75]
[null,null,null,"Empleados","Mercado Abierto",null,"Mercado Abierto - 10% Desc",null,"Mercado Abierto - 20% Desc"]
[null,null,"Valor Inmueble","Costo","Costo","Dif vs Empleado","Costo","Dif vs Empleado","Costo","Dif vs Empleado"]
[null,null,1000000,{"$f":"IF(C4<=500000,(((VLOOKUP(C4,'CALCULO Empleados'!$B$10:$N$18,MATCH(\"fija\",'CALCULO Empleados'!$B$10:$N$10,0),TRUE)+VLOOKUP(C4,'CALCULO Empleados'!$B$10:$N$18,MATCH(\"marginal\",'CALCULO Empleados'!$B$10:$N$10,0),TRUE)*(C4-VLOOKUP(C4,'CALCULO Empleados'!$B$10:$N$18,MATCH(\"Inferior\",'CALCULO Empleados'!$B$10:$N$10,0),TRUE))))*1.16),(((VLOOKUP(C4,'CALCULO Empleados'!$B$10:$N$18,MATCH(\"fija\",'CALCULO Empleados'!$B$10:$N$10,0),TRUE)+VLOOKUP(C4,'CALCULO Empleados'!$B$10:$N$18,MATCH(\"marginal\",'CALCULO Empleados'!$B$10:$N$10,0),TRUE)*(C4-VLOOKUP(C4,'CALCULO Empleados'!$B$10:$N$18,MATCH(\"Inferior\",'CALCULO Empleados'!$B$10:$N$10,0),TRUE)))*0.9)*1.16))","v":2547.3575152799999},{"$f":"IF((($C4*E$1)/1000)<=1413,1413,(IF((($C4*E$1)/1000)>18000,18000,(($C4*E$1)/1000))))","v":2750},{"$f":"E4-$D4","v":202.64248472000008},{"$f":"(IF((($C4*G$1)/1000)<=1413,1413,(IF((($C4*G$1)/1000)>18000,18000,(($C4*G$1)/1000)))))*0.9","v":2475},{"$f":"G4-$D4","v":-72.357515279999916},{"$f":"(IF((($C4*I$1)/1000)<=1413,1413,(IF((($C4*I$1)/1000)>18000,18000,(($C4*I$1)/1000)))))*0.8","v":2200},{"$f":"I4-$D4","v":-347.35751527999992}]
[null,null,{"$f":"C4+1000000","v":2000000},{"$f":"IF(C5<=500000,(((VLOOKUP(C5,'CALCULO Empleados'!$B$10:$N$18,MATCH(\"fija\",'CALCULO Empleados'!$B$10:$N$10,0),TRUE)+VLOOKUP(C5,'CALCULO Empleados'!$B$10:$N$18,MATCH(\"marginal\",'CALCULO Empleados'!$B$10:$N$10,0),TRUE)*(C5-VLOOKUP(C5,'CALCULO Empleados'!$B$10:$N$18,MATCH(\"Inferior\",'CALCULO Empleados'!$B$10:$N$10,0),TRUE))))*1.16),(((VLOOKUP(C5,'CALCULO Empleados'!$B$10:$N$18,MATCH(\"fija\",'CALCULO Empleados'!$B$10:$N$10,0),TRUE)+VLOOKUP(C5,'CALCULO Empleados'!$B$10:$N$18,MATCH(\"marginal\",'CALCULO Empleados'!$B$10:$N$10,0),TRUE)*(C5-VLOOKUP(C5,'CALCULO Empleados'!$B$10:$N$18,MATCH(\"Inferior\",'CALCULO Empleados'!$B$10:$N$10,0),TRUE)))*0.9)*1.16))","v":4823.2777240800006},{"$f":"IF((($C5*E$1)/1000)<=1413,1413,(IF((($C5*E$1)/1000)>18000,18000,(($C5*E$1)/1000))))","v":5500},{"$f":"E5-$D5","v":676.72227591999945},{"$f":"(IF((($C5*G$1)/1000)<=1413,1413,(IF((($C5*G$1)/1000)>18000,18000,(($C5*G$1)/1000)))))*0.9","v":4950},126.72227591999945,{"$f":"(IF((($C5*I$1)/1000)<=1413,1413,(IF((($C5*I$1)/1000)>18000,18000,(($C5*I$1)/1000)))))*0.8","v":4400},-423.27772408000055]
[null,null,{"$f":"C5+1000000","v":3000000},{"$f":"IF(C6<=500000,(((VLOOKUP(C6,'CALCULO Empleados'!$B$10:$N$18,MATCH(\"fija\",'CALCULO Empleados'!$B$10:$N$10,0),TRUE)+VLOOKUP(C6,'CALCULO Empleados'!$B$10:$N$18,MATCH(\"marginal\",'CALCULO Empleados'!$B$10:$N$10,0),TRUE)*(C6-VLOOKUP(C6,'CALCULO Empleados'!$B$10:$N$18,MATCH(\"Inferior\",'CALCULO Empleados'!$B$10:$N$10,0),TRUE))))*1.16),(((VLOOKUP(C6,'CALCULO Empleados'!$B$10:$N$18,MATCH(\"fija\",'CALCULO Empleados'!$B$10:$N$10,0),TRUE)+VLOOKUP(C6,'CALCULO Empleados'!$B$10:$N$18,MATCH(\"marginal\",'CALCULO Empleados'!$B$10:$N$10,0),TRUE)*(C6-VLOOKUP(C6,'CALCULO Empleados'!$B$10:$N$18,MATCH(\"Inferior\",'CALCULO Empleados'!$B$10:$N$10,0),TRUE)))*0.9)*1.16))","v":6796.43802684},8250,1453.56197316,7425,628.56197315999998,6600,-196.43802684000002]
[null,null,4000000,{"$f":"IF(C7<=500000,(((VLOOKUP(C7,'CALCULO Empleados'!$B$10:$N$18,MATCH(\"fija\",'CALCULO Empleados'!$B$10:$N$10,0),TRUE)+VLOOKUP(C7,'CALCULO Empleados'!$B$10:$N$18,MATCH(\"marginal\",'CALCULO Empleados'!$B$10:$N$10,0),TRUE)*(C7-VLOOKUP(C7,'CALCULO Empleados'!$B$10:$N$18,MATCH(\"Inferior\",'CALCULO Empleados'!$B$10:$N$10,0),TRUE))))*1.16),(((VLOOKUP(C7,'CALCULO Empleados'!$B$10:$N$18,MATCH(\"fija\",'CALCULO Empleados'!$B$10:$N$10,0),TRUE)+VLOOKUP(C7,'CALCULO Empleados'!$B$10:$N$18,MATCH(\"marginal\",'CALCULO Empleados'!$B$10:$N$10,0),TRUE)*(C7-VLOOKUP(C7,'CALCULO Empleados'!$B$10:$N$18,MATCH(\"Inferior\",'CALCULO Empleados'!$B$10:$N$10,0),TRUE)))*0.9)*1.16))","v":8769.5980268399999},11000,2230.4019731600001,9900,1130.4019731600001,8800,30.401973160000125]
[null,null,5000000,{"$f":"IF(C8<=500000,(((VLOOKUP(C8,'CALCULO Empleados'!$B$10:$N$18,MATCH(\"fija\",'CALCULO Empleados'!$B$10:$N$10,0),TRUE)+VLOOKUP(C8,'CALCULO Empleados'!$B$10:$N$18,MATCH(\"marginal\",'CALCULO Empleados'!$B$10:$N$10,0),TRUE)*(C8-VLOOKUP(C8,'CALCULO Empleados'!$B$10:$N$18,MATCH(\"Inferior\",'CALCULO Empleados'!$B$10:$N$10,0),TRUE))))*1.16),(((VLOOKUP(C8,'CALCULO Empleados'!$B$10:$N$18,MATCH(\"fija\",'CALCULO Empleados'!$B$10:$N$10,0),TRUE)+VLOOKUP(C8,'CALCULO Empleados'!$B$10:$N$18,MATCH(\"marginal\",'CALCULO Empleados'!$B$10:$N$10,0),TRUE)*(C8-VLOOKUP(C8,'CALCULO Empleados'!$B$10:$N$18,MATCH(\"Inferior\",'CALCULO Empleados'!$B$10:$N$10,0),TRUE)))*0.9)*1.16))","v":10419.118350479999},13750,3330.8816495200008,12375,1955.8816495200008,11000,580.88164952000079]
[null,null,6000000,{"$f":"IF(C9<=500000,(((VLOOKUP(C9,'CALCULO Empleados'!$B$10:$N$18,MATCH(\"fija\",'CALCULO Empleados'!$B$10:$N$10,0),TRUE)+VLOOKUP(C9,'CALCULO Empleados'!$B$10:$N$18,MATCH(\"marginal\",'CALCULO Empleados'!$B$10:$N$10,0),TRUE)*(C9-VLOOKUP(C9,'CALCULO Empleados'!$B$10:$N$18,MATCH(\"Inferior\",'CALCULO Empleados'!$B$10:$N$10,0),TRUE))))*1.16),(((VLOOKUP(C9,'CALCULO Empleados'!$B$10:$N$18,MATCH(\"fija\",'CALCULO Empleados'!$B$10:$N$10,0),TRUE)+VLOOKUP(C9,'CALCULO Empleados'!$B$10:$N$18,MATCH(\"marginal\",'CALCULO Empleados'!$B$10:$N$10,0),TRUE)*(C9-VLOOKUP(C9,'CALCULO Empleados'!$B$10:$N$18,MATCH(\"Inferior\",'CALCULO Empleados'!$B$10:$N$10,0),TRUE)))*0.9)*1.16))","v":12068.63835048},16500,4431.3616495200004,14850,2781.3616495200004,13200,1131.3616495200004]
[null,null,7000000,{"$f":"IF(C10<=500000,(((VLOOKUP(C10,'CALCULO Empleados'!$B$10:$N$18,MATCH(\"fija\",'CALCULO Empleados'!$B$10:$N$10,0),TRUE)+VLOOKUP(C10,'CALCULO Empleados'!$B$10:$N$18,MATCH(\"marginal\",'CALCULO Empleados'!$B$10:$N$10,0),TRUE)*(C10-VLOOKUP(C10,'CALCULO Empleados'!$B$10:$N$18,MATCH(\"Inferior\",'CALCULO Empleados'!$B$10:$N$10,0),TRUE))))*1.16),(((VLOOKUP(C10,'CALCULO Empleados'!$B$10:$N$18,MATCH(\"fija\",'CALCULO Empleados'!$B$10:$N$10,0),TRUE)+VLOOKUP(C10,'CALCULO Empleados'!$B$10:$N$18,MATCH(\"marginal\",'CALCULO Empleados'!$B$10:$N$10,0),TRUE)*(C10-VLOOKUP(C10,'CALCULO Empleados'!$B$10:$N$18,MATCH(\"Inferior\",'CALCULO Empleados'!$B$10:$N$10,0),TRUE)))*0.9)*1.16))","v":13718.15835048},18000,4281.8416495199999,16200,2481.8416495199999,14400,681.84164951999992]
[null,null,8000000,{"$f":"IF(C11<=500000,(((VLOOKUP(C11,'CALCULO Empleados'!$B$10:$N$18,MATCH(\"fija\",'CALCULO Empleados'!$B$10:$N$10,0),TRUE)+VLOOKUP(C11,'CALCULO Empleados'!$B$10:$N$18,MATCH(\"marginal\",'CALCULO Empleados'!$B$10:$N$10,0),TRUE)*(C11-VLOOKUP(C11,'CALCULO Empleados'!$B$10:$N$18,MATCH(\"Inferior\",'CALCULO Empleados'!$B$10:$N$10,0),TRUE))))*1.16),(((VLOOKUP(C11,'CALCULO Empleados'!$B$10:$N$18,MATCH(\"fija\",'CALCULO Empleados'!$B$10:$N$10,0),TRUE)+VLOOKUP(C11,'CALCULO Empleados'!$B$10:$N$18,MATCH(\"marginal\",'CALCULO Empleados'!$B$10:$N$10,0),TRUE)*(C11-VLOOKUP(C11,'CALCULO Empleados'!$B$10:$N$18,MATCH(\"Inferior\",'CALCULO Empleados'!$B$10:$N$10,0),TRUE)))*0.9)*1.16))","v":15367.678350480001},18000,2632.3216495199995,16200,832.32164951999948,14400,-967.67835048000052]
[null,null,9000000,{"$f":"IF(C12<=500000,(((VLOOKUP(C12,'CALCULO Empleados'!$B$10:$N$18,MATCH(\"fija\",'CALCULO Empleados'!$B$10:$N$10,0),TRUE)+VLOOKUP(C12,'CALCULO Empleados'!$B$10:$N$18,MATCH(\"marginal\",'CALCULO Empleados'!$B$10:$N$10,0),TRUE)*(C12-VLOOKUP(C12,'CALCULO Empleados'!$B$10:$N$18,MATCH(\"Inferior\",'CALCULO Empleados'!$B$10:$N$10,0),TRUE))))*1.16),(((VLOOKUP(C12,'CALCULO Empleados'!$B$10:$N$18,MATCH(\"fija\",'CALCULO Empleados'!$B$10:$N$10,0),TRUE)+VLOOKUP(C12,'CALCULO Empleados'!$B$10:$N$18,MATCH(\"marginal\",'CALCULO Empleados'!$B$10:$N$10,0),TRUE)*(C12-VLOOKUP(C12,'CALCULO Empleados'!$B$10:$N$18,MATCH(\"Inferior\",'CALCULO Empleados'!$B$10:$N$10,0),TRUE)))*0.9)*1.16))","v":16703.998663679999},18000,1296.0013363200014,16200,-503.99866367999857,14400,-2303.9986636799986]
[null,null,10000000,{"$f":"IF(C13<=500000,(((VLOOKUP(C13,'CALCULO Empleados'!$B$10:$N$18,MATCH(\"fija\",'CALCULO Empleados'!$B$10:$N$10,0),TRUE)+VLOOKUP(C13,'CALCULO Empleados'!$B$10:$N$18,MATCH(\"marginal\",'CALCULO Empleados'!$B$10:$N$10,0),TRUE)*(C13-VLOOKUP(C13,'CALCULO Empleados'!$B$10:$N$18,MATCH(\"Inferior\",'CALCULO Empleados'!$B$10:$N$10,0),TRUE))))*1.16),(((VLOOKUP(C13,'CALCULO Empleados'!$B$10:$N$18,MATCH(\"fija\",'CALCULO Empleados'!$B$10:$N$10,0),TRUE)+VLOOKUP(C13,'CALCULO Empleados'!$B$10:$N$18,MATCH(\"marginal\",'CALCULO Empleados'!$B$10:$N$10,0),TRUE)*(C13-VLOOKUP(C13,'CALCULO Empleados'!$B$10:$N$18,MATCH(\"Inferior\",'CALCULO Empleados'!$B$10:$N$10,0),TRUE)))*0.9)*1.16))","v":18040.318663679998},18000,-40.318663679998281,16200,-1840.3186636799983,14400,-3640.3186636799983]
[null,null,{"$f":"C13+5000000","v":15000000},{"$f":"IF(C14<=500000,(((VLOOKUP(C14,'CALCULO Empleados'!$B$10:$N$18,MATCH(\"fija\",'CALCULO Empleados'!$B$10:$N$10,0),TRUE)+VLOOKUP(C14,'CALCULO Empleados'!$B$10:$N$18,MATCH(\"marginal\",'CALCULO Empleados'!$B$10:$N$10,0),TRUE)*(C14-VLOOKUP(C14,'CALCULO Empleados'!$B$10:$N$18,MATCH(\"Inferior\",'CALCULO Empleados'!$B$10:$N$10,0),TRUE))))*1.16),(((VLOOKUP(C14,'CALCULO Empleados'!$B$10:$N$18,MATCH(\"fija\",'CALCULO Empleados'!$B$10:$N$10,0),TRUE)+VLOOKUP(C14,'CALCULO Empleados'!$B$10:$N$18,MATCH(\"marginal\",'CALCULO Empleados'!$B$10:$N$10,0),TRUE)*(C14-VLOOKUP(C14,'CALCULO Empleados'!$B$10:$N$18,MATCH(\"Inferior\",'CALCULO Empleados'!$B$10:$N$10,0),TRUE)))*0.9)*1.16))","v":24721.91866368},18000,-6721.9186636800005,16200,-8521.9186636800005,14400,-10321.91866368]
[null,null,{"$f":"C14+5000000","v":20000000},{"$f":"IF(C15<=500000,(((VLOOKUP(C15,'CALCULO Empleados'!$B$10:$N$18,MATCH(\"fija\",'CALCULO Empleados'!$B$10:$N$10,0),TRUE)+VLOOKUP(C15,'CALCULO Empleados'!$B$10:$N$18,MATCH(\"marginal\",'CALCULO Empleados'!$B$10:$N$10,0),TRUE)*(C15-VLOOKUP(C15,'CALCULO Empleados'!$B$10:$N$18,MATCH(\"Inferior\",'CALCULO Empleados'!$B$10:$N$10,0),TRUE))))*1.16),(((VLOOKUP(C15,'CALCULO Empleados'!$B$10:$N$18,MATCH(\"fija\",'CALCULO Empleados'!$B$10:$N$10,0),TRUE)+VLOOKUP(C15,'CALCULO Empleados'!$B$10:$N$18,MATCH(\"marginal\",'CALCULO Empleados'!$B$10:$N$10,0),TRUE)*(C15-VLOOKUP(C15,'CALCULO Empleados'!$B$10:$N$18,MATCH(\"Inferior\",'CALCULO Empleados'!$B$10:$N$10,0),TRUE)))*0.9)*1.16))","v":30317.75893512},18000,-12317.75893512,16200,-14117.75893512,14400,-15917.75893512]
{"$rows_left_out":6}